{"text_format":"1","workbook":"xlsx","n_sheets":3,"sheets":["Front page","Serial system","GOF test"],"not_rendered":{"charts":1,"images":0,"macros":1,"external_links":0,"defined_names":17,"comments":2,"pivot_tables":0},"unopened":[],"bounds":{"document_bytes":16777216,"sheet_cells":100000,"rows_first":2000,"rows_last":500,"rows_between":2000,"halvings":0,"cell_chars":16384,"cell_head_chars":4096},"cells_cut":0,"cells_raw":0,"read":"whole","date_system":"1900"}

{"sheet":"Front page","index":0,"n_rows":15,"n_cols":5,"rows_kept":15,"cut":false,"hidden":false,"merged":[]}
[]
[]
[null,null,null,null,"Decision Making"]
[null,null,null,null,"in"]
[null,null,null,null,"Physical Asset Management"]
[]
[]
[null,null,null,null,"Rui Assis"]
[null,null,null,null,"2012-08-19"]
[null,null,null,null,"rassis46@gmail.com"]
[null,null,null,null,"http://www.rassis.com"]
[]
[null,null,null,null,"Repairable serial system"]
[]
[null,null,null,null,"Blue cells for data, green cells for intermediate calculus and yellow cells for results"]

{"sheet":"Serial system","index":1,"n_rows":1019,"n_cols":31,"rows_kept":1019,"cut":false,"hidden":false,"merged":[[17,2,17,12],[17,18,17,28],[7,15,7,17],[8,15,9,15],[8,17,9,17],[17,14,17,16]]}
[]
[null,"t0 =",400,null,850,null,950,null,500,null,50,null,350,null,null,"Mission"]
[null,"a =",5,null,4,null,2.5,null,3.5,null,3,null,4,null,null,100]
[null,"b =",3550,null,1300,null,3800,null,4100,null,4570,null,2100]
[]
[null,"mX =",10,null,10,null,10,null,10,null,10,null,10]
[null,"sX =",0.8,null,0.8,null,0.8,null,0.8,null,0.8,null,0.8]
[null,"my =",{"$f":"IF(C6=\"\",\"\",LN(C6)-C9^2/2)","v":2.2993952895120264},null,{"$f":"IF(E6=\"\",\"\",LN(E6)-E9^2/2)","v":2.2993952895120264},null,{"$f":"IF(G6=\"\",\"\",LN(G6)-G9^2/2)","v":2.2993952895120264},null,{"$f":"IF(I6=\"\",\"\",LN(I6)-I9^2/2)","v":2.2993952895120264},null,{"$f":"IF(K6=\"\",\"\",LN(K6)-K9^2/2)","v":2.2993952895120264},null,{"$f":"IF(M6=\"\",\"\",LN(M6)-M9^2/2)","v":2.2993952895120264},null,null,"System"]
[null,"sy =",{"$f":"IF(C7=\"\",\"\",SQRT(LN(C7^2/C6^2+1)))","v":7.9872441830953114E-2},null,{"$f":"IF(E7=\"\",\"\",SQRT(LN(E7^2/E6^2+1)))","v":7.9872441830953114E-2},null,{"$f":"IF(G7=\"\",\"\",SQRT(LN(G7^2/G6^2+1)))","v":7.9872441830953114E-2},null,{"$f":"IF(I7=\"\",\"\",SQRT(LN(I7^2/I6^2+1)))","v":7.9872441830953114E-2},null,{"$f":"IF(K7=\"\",\"\",SQRT(LN(K7^2/K6^2+1)))","v":7.9872441830953114E-2},null,{"$f":"IF(M7=\"\",\"\",SQRT(LN(M7^2/M6^2+1)))","v":7.9872441830953114E-2},null,null,"Analytical method",null,"MC simulation"]
[null,null,"A",null,"B",null,"C",null,"D",null,"E",null,"F"]
[null,"MTTF =",{"$f":"IF(OR(C$3=\"\",C$4=\"\"),\"\",ROUND(C2+C4*EXP(GAMMALN(1+1/C3)),0))","v":3659},null,{"$f":"IF(OR(E$3=\"\",E$4=\"\"),\"\",ROUND(E2+E4*EXP(GAMMALN(1+1/E3)),0))","v":2028},null,{"$f":"IF(OR(G$3=\"\",G$4=\"\"),\"\",ROUND(G2+G4*EXP(GAMMALN(1+1/G3)),0))","v":4322},null,{"$f":"IF(OR(I$3=\"\",I$4=\"\"),\"\",ROUND(I2+I4*EXP(GAMMALN(1+1/I3)),0))","v":4189},null,{"$f":"IF(OR(K$3=\"\",K$4=\"\"),\"\",ROUND(K2+K4*EXP(GAMMALN(1+1/K3)),0))","v":4131},null,{"$f":"IF(OR(M$3=\"\",M$4=\"\"),\"\",ROUND(M2+M4*EXP(GAMMALN(1+1/M3)),0))","v":2253},null,"MTTF =",{"$f":"1/P12","v":520.17905566008392},"MTTF =",{"$f":"ROUND(AVERAGE(P30:P519),0)","v":519}]
[null,"Freq. =",{"$f":"IF(OR(C$3=\"\",C$4=\"\"),\"\",1/C11)","v":2.7329871549603714E-4},null,{"$f":"IF(OR(E$3=\"\",E$4=\"\"),\"\",1/E11)","v":4.9309664694280081E-4},null,{"$f":"IF(OR(G$3=\"\",G$4=\"\"),\"\",1/G11)","v":2.3137436372049977E-4},null,{"$f":"IF(OR(I$3=\"\",I$4=\"\"),\"\",1/I11)","v":2.3872045834328001E-4},null,{"$f":"IF(OR(K$3=\"\",K$4=\"\"),\"\",1/K11)","v":2.4207213749697409E-4},null,{"$f":"IF(OR(M$3=\"\",M$4=\"\"),\"\",1/M11)","v":4.4385264092321349E-4},null,"Freq. =",{"$f":"SUM(C12:M12)","v":1.9224149629228052E-3},"Freq. =",{"$f":"1/R11","v":1.9267822736030828E-3}]
[null,"R =",{"$f":"IF(OR(C$3=\"\",C$4=\"\"),\"\",IF(C2>$P$3,1,1-WEIBULL($P$3-C2,C3,C4,1)))","v":1},null,{"$f":"IF(OR(E$3=\"\",E$4=\"\"),\"\",IF(E2>$P$3,1,1-WEIBULL($P$3-E2,E3,E4,1)))","v":1},null,{"$f":"IF(OR(G$3=\"\",G$4=\"\"),\"\",IF(G2>$P$3,1,1-WEIBULL($P$3-G2,G3,G4,1)))","v":1},null,{"$f":"IF(OR(I$3=\"\",I$4=\"\"),\"\",IF(I2>$P$3,1,1-WEIBULL($P$3-I2,I3,I4,1)))","v":1},null,{"$f":"IF(OR(K$3=\"\",K$4=\"\"),\"\",IF(K2>$P$3,1,1-WEIBULL($P$3-K2,K3,K4,1)))","v":0.99999869033226485},null,{"$f":"IF(OR(M$3=\"\",M$4=\"\"),\"\",IF(M2>$P$3,1,1-WEIBULL($P$3-M2,M3,M4,1)))","v":1},null,"R =",{"$f":"EXP(-P3/P11)","v":0.82510758400714856},"R =",{"$f":"1-SUM(AE30:AE519)/490","v":0.84693877551020402}]
[]
[null,"MTTR =",{"$f":"IF(OR(C$3=\"\",C$4=\"\"),\"\",EXP(C8+C9^2/2))","v":10.000000000000002},null,{"$f":"IF(OR(E$3=\"\",E$4=\"\"),\"\",EXP(E8+E9^2/2))","v":10.000000000000002},null,{"$f":"IF(OR(G$3=\"\",G$4=\"\"),\"\",EXP(G8+G9^2/2))","v":10.000000000000002},null,{"$f":"IF(OR(I$3=\"\",I$4=\"\"),\"\",EXP(I8+I9^2/2))","v":10.000000000000002},null,{"$f":"IF(OR(K$3=\"\",K$4=\"\"),\"\",EXP(K8+K9^2/2))","v":10.000000000000002},null,{"$f":"IF(OR(M$3=\"\",M$4=\"\"),\"\",EXP(M8+M9^2/2))","v":10.000000000000002},null,"MTTR =",{"$f":"SUMPRODUCT(C15:M15,C12:M12)/P12","v":10.000000000000004},"MTTR =",{"$f":"AVERAGE(Q30:Q519)","v":9.9706324534768829}]
[null,"A =",{"$f":"IF(OR(C$3=\"\",C$4=\"\"),\"\",C11/(C11+C15))","v":0.99727446170618694},null,{"$f":"IF(OR(E$3=\"\",E$4=\"\"),\"\",E11/(E11+E15))","v":0.99509322865554461},null,{"$f":"IF(OR(G$3=\"\",G$4=\"\"),\"\",G11/(G11+G15))","v":0.99769159741458913},null,{"$f":"IF(OR(I$3=\"\",I$4=\"\"),\"\",I11/(I11+I15))","v":0.99761848059061686},null,{"$f":"IF(OR(K$3=\"\",K$4=\"\"),\"\",K11/(K11+K15))","v":0.99758512436609514},null,{"$f":"IF(OR(M$3=\"\",M$4=\"\"),\"\",M11/(M11+M15))","v":0.99558108705258508},null,"A =",{"$f":"P11/(P11+P15)","v":0.98113844767490899},"A =",{"$f":"SUM(P30:P519)/(SUM(Q30:Q519)+SUM(P30:P519))","v":0.98116446041019967}]
[]
[null,null,"Moments of failure of each component",null,null,null,null,null,null,null,null,null,null,null,"System failures",null,null,null,"Remaining life of each component",null,null,null,null,null,null,null,null,null,null,null,"Mission"]
[null,null,"A",null,"B",null,"C",null,"D",null,"E",null,"F",null,"Comp.","TTF","TTR",null,"A",null,"B",null,"C",null,"D",null,"E",null,"F",null,"failed?"]
[1,null,{"$f":"IF(OR(C$3=\"\",C$4=\"\"),\"\",C$2+C$4*(LN(1/(1-RAND())))^(1/C$3))","v":3979.1554763744239},null,{"$f":"IF(OR(E$3=\"\",E$4=\"\"),\"\",E$2+E$4*(LN(1/(1-RAND())))^(1/E$3))","v":1757.1347836663849},null,{"$f":"IF(OR(G$3=\"\",G$4=\"\"),\"\",G$2+G$4*(LN(1/(1-RAND())))^(1/G$3))","v":4355.1352004680321},null,{"$f":"IF(OR(I$3=\"\",I$4=\"\"),\"\",I$2+I$4*(LN(1/(1-RAND())))^(1/I$3))","v":4499.7668275704491},null,{"$f":"IF(OR(K$3=\"\",K$4=\"\"),\"\",K$2+K$4*(LN(1/(1-RAND())))^(1/K$3))","v":3409.2035147321185},null,{"$f":"IF(OR(M$3=\"\",M$4=\"\"),\"\",M$2+M$4*(LN(1/(1-RAND())))^(1/M$3))","v":2588.3693888380626},null,{"$f":"HLOOKUP(P20,C20:$M$520,A520,0)","v":"B"},{"$f":"MIN(C20:M20)","v":1757.1347836663849},{"$f":"IF(O20=C$19,EXP(NORMINV(RAND(),C$8,C$9)),IF(O20=E$19,EXP(NORMINV(RAND(),E$8,E$9)),IF(O20=G$19,EXP(NORMINV(RAND(),G$8,G$9)),IF(O20=I$19,EXP(NORMINV(RAND(),I$8,I$9)),IF(O20=K$19,EXP(NORMINV(RAND(),K$8,K$9)),IF(O20=M$19,EXP(NORMINV(RAND(),M$8,M$9))))))))","v":10.363385058253135},null,{"$f":"IF(OR(C$3=\"\",C$4=\"\"),\"\",IF($O20=S$19,0,C20-$P20))","v":2222.020692708039},null,{"$f":"IF(OR(E$3=\"\",E$4=\"\"),\"\",IF($O20=U$19,0,E20-$P20))","v":0},null,{"$f":"IF(OR(G$3=\"\",G$4=\"\"),\"\",IF($O20=W$19,0,G20-$P20))","v":2598.0004168016471},null,{"$f":"IF(OR(I$3=\"\",I$4=\"\"),\"\",IF($O20=Y$19,0,I20-$P20))","v":2742.6320439040642},null,{"$f":"IF(OR(K$3=\"\",K$4=\"\"),\"\",IF($O20=AA$19,0,K20-$P20))","v":1652.0687310657336},null,{"$f":"IF(OR(M$3=\"\",M$4=\"\"),\"\",IF($O20=AC$19,0,M20-$P20))","v":831.23460517167769},null,{"$f":"IF(P20>=$P$3,0,1)","v":0}]
[2,null,{"$f":"IF(OR(C$3=\"\",C$4=\"\"),\"\",IF(S20=0,C$2+C$4*(LN(1/(1-RAND())))^(1/C$3),S20))","v":2222.020692708039},null,{"$f":"IF(OR(E$3=\"\",E$4=\"\"),\"\",IF(U20=0,E$2+E$4*(LN(1/(1-RAND())))^(1/E$3),U20))","v":1990.8567867740906},null,{"$f":"IF(OR(G$3=\"\",G$4=\"\"),\"\",IF(W20=0,G$2+G$4*(LN(1/(1-RAND())))^(1/G$3),W20))","v":2598.0004168016471},null,{"$f":"IF(OR(I$3=\"\",I$4=\"\"),\"\",IF(Y20=0,I$2+I$4*(LN(1/(1-RAND())))^(1/I$3),Y20))","v":2742.6320439040642},null,{"$f":"IF(OR(K$3=\"\",K$4=\"\"),\"\",IF(AA20=0,K$2+K$4*(LN(1/(1-RAND())))^(1/K$3),AA20))","v":1652.0687310657336},null,{"$f":"IF(OR(M$3=\"\",M$4=\"\"),\"\",IF(AC20=0,M$2+M$4*(LN(1/(1-RAND())))^(1/M$3),AC20))","v":831.23460517167769},null,{"$f":"HLOOKUP(P21,C21:$M$520,A521,0)","v":"F"},831.23460517167769,11.242414808055171,null,1390.7860875363613,null,1159.6221816024129,null,1766.7658116299694,null,1911.3974387323865,null,820.83412589405589,null,0,null,0]
[3,null,{"$f":"IF(OR(C$3=\"\",C$4=\"\"),\"\",IF(S21=0,C$2+C$4*(LN(1/(1-RAND())))^(1/C$3),S21))","v":1390.7860875363613},null,{"$f":"IF(OR(E$3=\"\",E$4=\"\"),\"\",IF(U21=0,E$2+E$4*(LN(1/(1-RAND())))^(1/E$3),U21))","v":1159.6221816024129},null,{"$f":"IF(OR(G$3=\"\",G$4=\"\"),\"\",IF(W21=0,G$2+G$4*(LN(1/(1-RAND())))^(1/G$3),W21))","v":1766.7658116299694},null,{"$f":"IF(OR(I$3=\"\",I$4=\"\"),\"\",IF(Y21=0,I$2+I$4*(LN(1/(1-RAND())))^(1/I$3),Y21))","v":1911.3974387323865},null,{"$f":"IF(OR(K$3=\"\",K$4=\"\"),\"\",IF(AA21=0,K$2+K$4*(LN(1/(1-RAND())))^(1/K$3),AA21))","v":820.83412589405589},null,{"$f":"IF(OR(M$3=\"\",M$4=\"\"),\"\",IF(AC21=0,M$2+M$4*(LN(1/(1-RAND())))^(1/M$3),AC21))","v":2815.423865350549},null,{"$f":"HLOOKUP(P22,C22:$M$520,A522,0)","v":"E"},820.83412589405589,8.6759899710823714,null,569.95196164230538,null,338.78805570835698,null,945.93168573591356,null,1090.5633128383306,null,0,null,1994.5897394564931,null,0]
[4,null,569.95196164230538,null,338.78805570835698,null,945.93168573591356,null,1090.5633128383306,null,2080.819106985844,null,1994.5897394564931,null,{"$f":"HLOOKUP(P23,C23:$M$520,A523,0)","v":"B"},338.78805570835698,9.6742273936959187,null,231.1639059339484,null,0,null,607.14363002755658,null,751.77525712997362,null,1742.031051277487,null,1655.8016837481362,null,0]
[5,null,231.1639059339484,null,2627.0034853662892,null,607.14363002755658,null,751.77525712997362,null,1742.031051277487,null,1655.8016837481362,null,{"$f":"HLOOKUP(P24,C24:$M$520,A524,0)","v":"A"},231.1639059339484,10.914409249861894,null,0,null,2395.8395794323405,null,375.97972409360818,null,520.61135119602523,null,1510.8671453435386,null,1424.6377778141878,null,0]
[6,null,4291.3870748825157,null,2395.8395794323405,null,375.97972409360818,null,520.61135119602523,null,1510.8671453435386,null,1424.6377778141878,null,{"$f":"HLOOKUP(P25,C25:$M$520,A525,0)","v":"C"},375.97972409360818,9.2697250260559194,null,3915.4073507889075,null,2019.8598553387324,null,0,null,144.63162710241704,null,1134.8874212499304,null,1048.6580537205796,null,0]
[7,null,3915.4073507889075,null,2019.8598553387324,null,3015.8376261589588,null,144.63162710241704,null,1134.8874212499304,null,1048.6580537205796,null,{"$f":"HLOOKUP(P26,C26:$M$520,A526,0)","v":"D"},144.63162710241704,10.163062038727787,null,3770.7757236864904,null,1875.2282282363153,null,2871.2059990565417,null,0,null,990.25579414751337,null,904.02642661816253,null,0]
[8,null,3770.7757236864904,null,1875.2282282363153,null,2871.2059990565417,null,2344.3242444643911,null,990.25579414751337,null,904.02642661816253,null,{"$f":"HLOOKUP(P27,C27:$M$520,A527,0)","v":"F"},904.02642661816253,10.959958159121365,null,2866.7492970683279,null,971.20180161815279,null,1967.1795724383792,null,1440.2978178462286,null,86.229367529350839,null,0,null,0]
[9,null,2866.7492970683279,null,971.20180161815279,null,1967.1795724383792,null,1440.2978178462286,null,86.229367529350839,null,2656.130952497339,null,{"$f":"HLOOKUP(P28,C28:$M$520,A528,0)","v":"E"},86.229367529350839,9.81879272304033,null,2780.5199295389771,null,884.97243408880195,null,1880.9502049090283,null,1354.0684503168777,null,0,null,2569.9015849679881,null,1]
[10,null,2780.5199295389771,null,884.97243408880195,null,1880.9502049090283,null,1354.0684503168777,null,4379.2767122289843,null,2569.9015849679881,null,{"$f":"HLOOKUP(P29,C29:$M$520,A529,0)","v":"B"},884.97243408880195,9.4259932438166008,null,1895.5474954501751,null,0,null,995.9777708202264,null,469.09601622807577,null,3494.3042781401823,null,1684.9291508791862,null,0]
[11,null,1895.5474954501751,null,1641.6942614566424,null,995.9777708202264,null,469.09601622807577,null,3494.3042781401823,null,1684.9291508791862,null,{"$f":"HLOOKUP(P30,C30:$M$520,A530,0)","v":"D"},469.09601622807577,9.3665375373927695,null,1426.4514792220994,null,1172.5982452285666,null,526.88175459215063,null,0,null,3025.2082619121065,null,1215.8331346511104,null,0]
[12,null,1426.4514792220994,null,1172.5982452285666,null,526.88175459215063,null,3728.1791898571159,null,3025.2082619121065,null,1215.8331346511104,null,{"$f":"HLOOKUP(P31,C31:$M$520,A531,0)","v":"C"},526.88175459215063,11.435978751124633,null,899.56972462994872,null,645.71649063641598,null,0,null,3201.2974352649653,null,2498.3265073199559,null,688.95138005895978,null,0]
[13,null,899.56972462994872,null,645.71649063641598,null,2047.0627467984029,null,3201.2974352649653,null,2498.3265073199559,null,688.95138005895978,null,{"$f":"HLOOKUP(P32,C32:$M$520,A532,0)","v":"B"},645.71649063641598,10.714456274429201,null,253.85323399353274,null,0,null,1401.346256161987,null,2555.5809446285493,null,1852.6100166835399,null,43.234889422543802,null,0]
[14,null,253.85323399353274,null,1784.2859747219291,null,1401.346256161987,null,2555.5809446285493,null,1852.6100166835399,null,43.234889422543802,null,{"$f":"HLOOKUP(P33,C33:$M$520,A533,0)","v":"F"},43.234889422543802,10.7735001910275,null,210.61834457098894,null,1741.0510852993852,null,1358.1113667394432,null,2512.3460552060055,null,1809.3751272609961,null,0,null,1]
[15,null,210.61834457098894,null,1741.0510852993852,null,1358.1113667394432,null,2512.3460552060055,null,1809.3751272609961,null,2422.1186440638467,null,{"$f":"HLOOKUP(P34,C34:$M$520,A534,0)","v":"A"},210.61834457098894,9.9398264033075687,null,0,null,1530.4327407283963,null,1147.4930221684542,null,2301.7277106350166,null,1598.7567826900072,null,2211.5002994928577,null,0]
[16,null,3158.6111316177926,null,1530.4327407283963,null,1147.4930221684542,null,2301.7277106350166,null,1598.7567826900072,null,2211.5002994928577,null,{"$f":"HLOOKUP(P35,C35:$M$520,A535,0)","v":"C"},1147.4930221684542,9.6073002911588468,null,2011.1181094493384,null,382.93971855994209,null,0,null,1154.2346884665624,null,451.26376052155297,null,1064.0072773244035,null,0]
[17,null,2011.1181094493384,null,382.93971855994209,null,3002.873311957997,null,1154.2346884665624,null,451.26376052155297,null,1064.0072773244035,null,{"$f":"HLOOKUP(P36,C36:$M$520,A536,0)","v":"B"},382.93971855994209,10.292783614974045,null,1628.1783908893963,null,0,null,2619.9335933980547,null,771.29496990662028,null,68.324041961610874,null,681.06755876446141,null,0]
[18,null,1628.1783908893963,null,2170.8096392711832,null,2619.9335933980547,null,771.29496990662028,null,68.324041961610874,null,681.06755876446141,null,{"$f":"HLOOKUP(P37,C37:$M$520,A537,0)","v":"E"},68.324041961610874,10.320190516096266,null,1559.8543489277854,null,2102.4855973095723,null,2551.6095514364438,null,702.97092794500941,null,0,null,612.74351680285054,null,1]
[19,null,1559.8543489277854,null,2102.4855973095723,null,2551.6095514364438,null,702.97092794500941,null,3929.6548062284414,null,612.74351680285054,null,{"$f":"HLOOKUP(P38,C38:$M$520,A538,0)","v":"F"},612.74351680285054,10.368332762216788,null,947.11083212493486,null,1489.7420805067218,null,1938.8660346335932,null,90.227411142158871,null,3316.9112894255909,null,0,null,0]
[20,null,947.11083212493486,null,1489.7420805067218,null,1938.8660346335932,null,90.227411142158871,null,3316.9112894255909,null,1481.9339586185508,null,{"$f":"HLOOKUP(P39,C39:$M$520,A539,0)","v":"D"},90.227411142158871,9.7345186740297862,null,856.88342098277599,null,1399.5146693645629,null,1848.6386234914344,null,0,null,3226.683878283432,null,1391.706547476392,null,1]
[21,null,856.88342098277599,null,1399.5146693645629,null,1848.6386234914344,null,2494.6462129224929,null,3226.683878283432,null,1391.706547476392,null,{"$f":"HLOOKUP(P40,C40:$M$520,A540,0)","v":"A"},856.88342098277599,9.953492334319364,null,0,null,542.63124838178692,null,991.75520250865839,null,1637.7627919397169,null,2369.800457300656,null,534.82312649361597,null,0]
[22,null,3048.1380210049019,null,542.63124838178692,null,991.75520250865839,null,1637.7627919397169,null,2369.800457300656,null,534.82312649361597,null,{"$f":"HLOOKUP(P41,C41:$M$520,A541,0)","v":"F"},534.82312649361597,10.235603319280296,null,2513.3148945112862,null,7.8081218881709447,null,456.93207601504241,null,1102.9396654461009,null,1834.9773308070401,null,0,null,0]
[23,null,2513.3148945112862,null,7.8081218881709447,null,456.93207601504241,null,1102.9396654461009,null,1834.9773308070401,null,1945.2768842613389,null,{"$f":"HLOOKUP(P42,C42:$M$520,A542,0)","v":"B"},7.8081218881709447,8.669223126549813,null,2505.5067726231155,null,0,null,449.12395412687147,null,1095.1315435579299,null,1827.1692089188691,null,1937.4687623731679,null,1]
[24,null,2505.5067726231155,null,2251.792422094748,null,449.12395412687147,null,1095.1315435579299,null,1827.1692089188691,null,1937.4687623731679,null,{"$f":"HLOOKUP(P43,C43:$M$520,A543,0)","v":"C"},449.12395412687147,10.069466212692674,null,2056.382818496244,null,1802.6684679678765,null,0,null,646.00758943105848,null,1378.0452547919976,null,1488.3448082462965,null,0]
[25,null,2056.382818496244,null,1802.6684679678765,null,3045.020440553053,null,646.00758943105848,null,1378.0452547919976,null,1488.3448082462965,null,{"$f":"HLOOKUP(P44,C44:$M$520,A544,0)","v":"D"},646.00758943105848,9.1460342954174454,null,1410.3752290651855,null,1156.660878536818,null,2399.0128511219946,null,0,null,732.03766536093917,null,842.33721881523797,null,0]
[26,null,1410.3752290651855,null,1156.660878536818,null,2399.0128511219946,null,3545.3580372445572,null,732.03766536093917,null,842.33721881523797,null,{"$f":"HLOOKUP(P45,C45:$M$520,A545,0)","v":"E"},732.03766536093917,10.548119649707354,null,678.33756370424635,null,424.62321317587885,null,1666.9751857610554,null,2813.320371883618,null,0,null,110.2995534542988,null,0]
[27,null,678.33756370424635,null,424.62321317587885,null,1666.9751857610554,null,2813.320371883618,null,4579.2256202124381,null,110.2995534542988,null,{"$f":"HLOOKUP(P46,C46:$M$520,A546,0)","v":"F"},110.2995534542988,10.680033501499107,null,568.03801024994755,null,314.32365972158004,null,1556.6756323067566,null,2703.0208184293192,null,4468.9260667581393,null,0,null,0]
[28,null,568.03801024994755,null,314.32365972158004,null,1556.6756323067566,null,2703.0208184293192,null,4468.9260667581393,null,2049.2555666535045,null,{"$f":"HLOOKUP(P47,C47:$M$520,A547,0)","v":"B"},314.32365972158004,10.419237985466495,null,253.7143505283675,null,0,null,1242.3519725851766,null,2388.6971587077392,null,4154.6024070365593,null,1734.9319069319245,null,0]
[29,null,253.7143505283675,null,2450.6213857895486,null,1242.3519725851766,null,2388.6971587077392,null,4154.6024070365593,null,1734.9319069319245,null,{"$f":"HLOOKUP(P48,C48:$M$520,A548,0)","v":"A"},253.7143505283675,11.093948494209222,null,0,null,2196.9070352611811,null,988.63762205680905,null,2134.9828081793717,null,3900.8880565081918,null,1481.217556403557,null,0]
[30,null,3585.7311072380717,null,2196.9070352611811,null,988.63762205680905,null,2134.9828081793717,null,3900.8880565081918,null,1481.217556403557,null,{"$f":"HLOOKUP(P49,C49:$M$520,A549,0)","v":"C"},988.63762205680905,8.8567230735866982,null,2597.0934851812626,null,1208.2694132043721,null,0,null,1146.3451861225626,null,2912.2504344513827,null,492.5799343467479,null,0]
[31,null,2597.0934851812626,null,1208.2694132043721,null,6150.0399764425447,null,1146.3451861225626,null,2912.2504344513827,null,492.5799343467479,null,{"$f":"HLOOKUP(P50,C50:$M$520,A550,0)","v":"F"},492.5799343467479,9.0937721165641801,null,2104.5135508345147,null,715.68947885762418,null,5657.4600420957968,null,653.7652517758147,null,2419.6705001046348,null,0,null,0]
[32,null,2104.5135508345147,null,715.68947885762418,null,5657.4600420957968,null,653.7652517758147,null,2419.6705001046348,null,1686.4876446988235,null,{"$f":"HLOOKUP(P51,C51:$M$520,A551,0)","v":"D"},653.7652517758147,10.281662003539433,null,1450.7482990587,null,61.924227081809477,null,5003.6947903199816,null,0,null,1765.9052483288201,null,1032.7223929230088,null,0]
[33,null,1450.7482990587,null,61.924227081809477,null,5003.6947903199816,null,5111.8017860497712,null,1765.9052483288201,null,1032.7223929230088,null,{"$f":"HLOOKUP(P52,C52:$M$520,A552,0)","v":"B"},61.924227081809477,11.229074848869764,null,1388.8240719768905,null,0,null,4941.7705632381721,null,5049.8775589679617,null,1703.9810212470106,null,970.79816584119931,null,1]
[34,null,1388.8240719768905,null,1959.2551817458116,null,4941.7705632381721,null,5049.8775589679617,null,1703.9810212470106,null,970.79816584119931,null,{"$f":"HLOOKUP(P53,C53:$M$520,A553,0)","v":"F"},970.79816584119931,10.333724985904578,null,418.02590613569123,null,988.45701590461226,null,3970.9723973969731,null,4079.0793931267626,null,733.18285540581132,null,0,null,0]
[35,null,418.02590613569123,null,988.45701590461226,null,3970.9723973969731,null,4079.0793931267626,null,733.18285540581132,null,2300.9351124647637,null,{"$f":"HLOOKUP(P54,C54:$M$520,A554,0)","v":"A"},418.02590613569123,11.454191025730427,null,0,null,570.43110976892103,null,3552.9464912612821,null,3661.0534869910716,null,315.15694927012009,null,1882.9092063290725,null,0]
[36,null,3939.9923889836869,null,570.43110976892103,null,3552.9464912612821,null,3661.0534869910716,null,315.15694927012009,null,1882.9092063290725,null,{"$f":"HLOOKUP(P55,C55:$M$520,A555,0)","v":"E"},315.15694927012009,9.419241830542374,null,3624.8354397135668,null,255.27416049880094,null,3237.789541991162,null,3345.8965377209515,null,0,null,1567.7522570589524,null,0]
[37,null,3624.8354397135668,null,255.27416049880094,null,3237.789541991162,null,3345.8965377209515,null,2471.3934275458423,null,1567.7522570589524,null,{"$f":"HLOOKUP(P56,C56:$M$520,A556,0)","v":"B"},255.27416049880094,10.125647432114601,null,3369.5612792147658,null,0,null,2982.515381492361,null,3090.6223772221506,null,2216.1192670470414,null,1312.4780965601515,null,0]
[38,null,3369.5612792147658,null,1933.4723607238245,null,2982.515381492361,null,3090.6223772221506,null,2216.1192670470414,null,1312.4780965601515,null,{"$f":"HLOOKUP(P57,C57:$M$520,A557,0)","v":"F"},1312.4780965601515,9.955306148524139,null,2057.0831826546146,null,620.99426416367305,null,1670.0372849322096,null,1778.1442806619991,null,903.64117048688991,null,0,null,0]
[39,null,2057.0831826546146,null,620.99426416367305,null,1670.0372849322096,null,1778.1442806619991,null,903.64117048688991,null,1463.6138696198259,null,{"$f":"HLOOKUP(P58,C58:$M$520,A558,0)","v":"B"},620.99426416367305,9.8178149544609692,null,1436.0889184909415,null,0,null,1049.0430207685365,null,1157.1500164983261,null,282.64690632321685,null,842.61960545615284,null,0]
[40,null,1436.0889184909415,null,1757.9052082811768,null,1049.0430207685365,null,1157.1500164983261,null,282.64690632321685,null,842.61960545615284,null,{"$f":"HLOOKUP(P59,C59:$M$520,A559,0)","v":"E"},282.64690632321685,8.891916025988138,null,1153.4420121677247,null,1475.2583019579599,null,766.39611444531965,null,874.50311017510921,null,0,null,559.97269913293599,null,0]
[41,null,1153.4420121677247,null,1475.2583019579599,null,766.39611444531965,null,874.50311017510921,null,4337.1255923319732,null,559.97269913293599,null,{"$f":"HLOOKUP(P60,C60:$M$520,A560,0)","v":"F"},559.97269913293599,11.131711247180327,null,593.46931303478868,null,915.28560282502394,null,206.42341531238367,null,314.53041104217323,null,3777.152893199037,null,0,null,0]
[42,null,593.46931303478868,null,915.28560282502394,null,206.42341531238367,null,314.53041104217323,null,3777.152893199037,null,1714.2102703457542,null,{"$f":"HLOOKUP(P61,C61:$M$520,A561,0)","v":"C"},206.42341531238367,10.137309180503951,null,387.04589772240502,null,708.86218751264028,null,0,null,108.10699572978956,null,3570.7294778866535,null,1507.7868550333706,null,0]
[43,null,387.04589772240502,null,708.86218751264028,null,3556.4936730305208,null,108.10699572978956,null,3570.7294778866535,null,1507.7868550333706,null,{"$f":"HLOOKUP(P62,C62:$M$520,A562,0)","v":"D"},108.10699572978956,10.162362560988363,null,278.93890199261546,null,600.75519178285072,null,3448.3866773007312,null,0,null,3462.622482156864,null,1399.679859303581,null,0]
[44,null,278.93890199261546,null,600.75519178285072,null,3448.3866773007312,null,5713.7255431736057,null,3462.622482156864,null,1399.679859303581,null,{"$f":"HLOOKUP(P63,C63:$M$520,A563,0)","v":"A"},278.93890199261546,10.668595711060991,null,0,null,321.81628979023526,null,3169.4477753081155,null,5434.78664118099,null,3183.6835801642483,null,1120.7409573109655,null,0]
[45,null,4029.1153809710681,null,321.81628979023526,null,3169.4477753081155,null,5434.78664118099,null,3183.6835801642483,null,1120.7409573109655,null,{"$f":"HLOOKUP(P64,C64:$M$520,A564,0)","v":"B"},321.81628979023526,9.9571183228090181,null,3707.2990911808329,null,0,null,2847.6314855178803,null,5112.9703513907552,null,2861.867290374013,null,798.92466752073028,null,0]
[46,null,3707.2990911808329,null,2187.3074177489098,null,2847.6314855178803,null,5112.9703513907552,null,2861.867290374013,null,798.92466752073028,null,{"$f":"HLOOKUP(P65,C65:$M$520,A565,0)","v":"F"},798.92466752073028,11.51178053549936,null,2908.3744236601024,null,1388.3827502281795,null,2048.7068179971502,null,4314.0456838700247,null,2062.942622853283,null,0,null,0]
[47,null,2908.3744236601024,null,1388.3827502281795,null,2048.7068179971502,null,4314.0456838700247,null,2062.942622853283,null,2374.7194634269772,null,{"$f":"HLOOKUP(P66,C66:$M$520,A566,0)","v":"B"},1388.3827502281795,9.259862709289564,null,1519.9916734319229,null,0,null,660.32406776897074,null,2925.6629336418455,null,674.55987262510348,null,986.33671319879772,null,0]
[48,null,1519.9916734319229,null,1431.3923873998342,null,660.32406776897074,null,2925.6629336418455,null,674.55987262510348,null,986.33671319879772,null,{"$f":"HLOOKUP(P67,C67:$M$520,A567,0)","v":"C"},660.32406776897074,10.08080898970303,null,859.66760566295216,null,771.06831963086347,null,0,null,2265.3388658728745,null,14.235804856132745,null,326.01264542982699,null,0]
[49,null,859.66760566295216,null,771.06831963086347,null,6371.3435714514662,null,2265.3388658728745,null,14.235804856132745,null,326.01264542982699,null,{"$f":"HLOOKUP(P68,C68:$M$520,A568,0)","v":"E"},14.235804856132745,10.474921717160255,null,845.43180080681941,null,756.83251477473073,null,6357.1077665953335,null,2251.1030610167418,null,0,null,311.77684057369424,null,1]
[50,null,845.43180080681941,null,756.83251477473073,null,6357.1077665953335,null,2251.1030610167418,null,2349.4406724578103,null,311.77684057369424,null,{"$f":"HLOOKUP(P69,C69:$M$520,A569,0)","v":"F"},311.77684057369424,10.924837101300612,null,533.65496023312517,null,445.05567420103648,null,6045.3309260216392,null,1939.3262204430475,null,2037.663831884116,null,0,null,0]
[51,null,533.65496023312517,null,445.05567420103648,null,6045.3309260216392,null,1939.3262204430475,null,2037.663831884116,null,3186.7374798199849,null,{"$f":"HLOOKUP(P70,C70:$M$520,A570,0)","v":"B"},445.05567420103648,9.9895298849715584,null,88.599286032088685,null,0,null,5600.2752518206025,null,1494.2705462420111,null,1592.6081576830795,null,2741.6818056189486,null,0]
[52,null,88.599286032088685,null,1851.2082722992295,null,5600.2752518206025,null,1494.2705462420111,null,1592.6081576830795,null,2741.6818056189486,null,{"$f":"HLOOKUP(P71,C71:$M$520,A571,0)","v":"A"},88.599286032088685,9.4374517142564276,null,0,null,1762.6089862671408,null,5511.6759657885141,null,1405.6712602099224,null,1504.0088716509908,null,2653.0825195868601,null,1]
[53,null,4243.2542201210126,null,1762.6089862671408,null,5511.6759657885141,null,1405.6712602099224,null,1504.0088716509908,null,2653.0825195868601,null,{"$f":"HLOOKUP(P72,C72:$M$520,A572,0)","v":"D"},1405.6712602099224,10.268186845227882,null,2837.5829599110903,null,356.93772605721847,null,4106.0047055785917,null,0,null,98.337611441068475,null,1247.4112593769378,null,0]
[54,null,2837.5829599110903,null,356.93772605721847,null,4106.0047055785917,null,4169.5833022948937,null,98.337611441068475,null,1247.4112593769378,null,{"$f":"HLOOKUP(P73,C73:$M$520,A573,0)","v":"E"},98.337611441068475,9.4251747612689929,null,2739.2453484700218,null,258.60011461614999,null,4007.6670941375232,null,4071.2456908538252,null,0,null,1149.0736479358693,null,1]
[55,null,2739.2453484700218,null,258.60011461614999,null,4007.6670941375232,null,4071.2456908538252,null,3803.3110686939485,null,1149.0736479358693,null,{"$f":"HLOOKUP(P74,C74:$M$520,A574,0)","v":"B"},258.60011461614999,10.591063328352964,null,2480.645233853872,null,0,null,3749.0669795213735,null,3812.6455762376754,null,3544.7109540777983,null,890.47353331971931,null,0]
[56,null,2480.645233853872,null,2106.9274586034089,null,3749.0669795213735,null,3812.6455762376754,null,3544.7109540777983,null,890.47353331971931,null,{"$f":"HLOOKUP(P75,C75:$M$520,A575,0)","v":"F"},890.47353331971931,10.946160627988778,null,1590.1717005341527,null,1216.4539252836896,null,2858.5934462016539,null,2922.1720429179559,null,2654.2374207580788,null,0,null,0]
[57,null,1590.1717005341527,null,1216.4539252836896,null,2858.5934462016539,null,2922.1720429179559,null,2654.2374207580788,null,2884.1301348870984,null,{"$f":"HLOOKUP(P76,C76:$M$520,A576,0)","v":"B"},1216.4539252836896,9.1393510038019752,null,373.71777525046309,null,0,null,1642.1395209179643,null,1705.7181176342663,null,1437.7834954743892,null,1667.6762096034088,null,0]
[58,null,373.71777525046309,null,2292.3199656831202,null,1642.1395209179643,null,1705.7181176342663,null,1437.7834954743892,null,1667.6762096034088,null,{"$f":"HLOOKUP(P77,C77:$M$520,A577,0)","v":"A"},373.71777525046309,8.7017120511317856,null,0,null,1918.6021904326572,null,1268.4217456675012,null,1332.0003423838032,null,1064.0657202239261,null,1293.9584343529457,null,0]
[59,null,3625.0515190545393,null,1918.6021904326572,null,1268.4217456675012,null,1332.0003423838032,null,1064.0657202239261,null,1293.9584343529457,null,{"$f":"HLOOKUP(P78,C78:$M$520,A578,0)","v":"E"},1064.0657202239261,8.9175450945345176,null,2560.985798830613,null,854.53647020873109,null,204.35602544357516,null,267.93462215987711,null,0,null,229.89271412901962,null,0]
[60,null,2560.985798830613,null,854.53647020873109,null,204.35602544357516,null,267.93462215987711,null,4500.4624388049679,null,229.89271412901962,null,{"$f":"HLOOKUP(P79,C79:$M$520,A579,0)","v":"C"},204.35602544357516,9.7573621514435516,null,2356.6297733870379,null,650.18044476515593,null,0,null,63.578596716301945,null,4296.1064133613927,null,25.53668868544446,null,0]
[61,null,2356.6297733870379,null,650.18044476515593,null,4239.1852305706889,null,63.578596716301945,null,4296.1064133613927,null,25.53668868544446,null,{"$f":"HLOOKUP(P80,C80:$M$520,A580,0)","v":"F"},25.53668868544446,7.2331729937917286,null,2331.0930847015934,null,624.64375607971147,null,4213.6485418852444,null,38.041908030857485,null,4270.5697246759482,null,0,null,1]
[62,null,2331.0930847015934,null,624.64375607971147,null,4213.6485418852444,null,38.041908030857485,null,4270.5697246759482,null,2755.5410482846614,null,{"$f":"HLOOKUP(P81,C81:$M$520,A581,0)","v":"D"},38.041908030857485,9.2295021735830982,null,2293.0511766707359,null,586.60184804885398,null,4175.6066338543869,null,0,null,4232.5278166450908,null,2717.4991402538039,null,1]
[63,null,2293.0511766707359,null,586.60184804885398,null,4175.6066338543869,null,6042.1774284744288,null,4232.5278166450908,null,2717.4991402538039,null,{"$f":"HLOOKUP(P82,C82:$M$520,A582,0)","v":"B"},586.60184804885398,9.3560209887056605,null,1706.4493286218819,null,0,null,3589.0047858055332,null,5455.575580425575,null,3645.925968596237,null,2130.8972922049497,null,0]
[64,null,1706.4493286218819,null,1957.8832203166373,null,3589.0047858055332,null,5455.575580425575,null,3645.925968596237,null,2130.8972922049497,null,{"$f":"HLOOKUP(P83,C83:$M$520,A583,0)","v":"A"},1706.4493286218819,9.1321888121258219,null,0,null,251.4338916947554,null,1882.5554571836512,null,3749.1262518036929,null,1939.4766399743551,null,424.4479635830678,null,0]
[65,null,2579.5842505524001,null,251.4338916947554,null,1882.5554571836512,null,3749.1262518036929,null,1939.4766399743551,null,424.4479635830678,null,{"$f":"HLOOKUP(P84,C84:$M$520,A584,0)","v":"B"},{"$f":"MIN(C84:M84)","v":251.4338916947554},{"$f":"IF(O84=C$19,EXP(NORMINV(RAND(),C$8,C$9)),IF(O84=E$19,EXP(NORMINV(RAND(),E$8,E$9)),IF(O84=G$19,EXP(NORMINV(RAND(),G$8,G$9)),IF(O84=I$19,EXP(NORMINV(RAND(),I$8,I$9)),IF(O84=K$19,EXP(NORMINV(RAND(),K$8,K$9)),IF(O84=M$19,EXP(NORMINV(RAND(),M$8,M$9))))))))","v":8.7889386320333749},null,{"$f":"IF(OR(C$3=\"\",C$4=\"\"),\"\",IF($O84=S$19,0,C84-$P84))","v":2328.1503588576447},null,{"$f":"IF(OR(E$3=\"\",E$4=\"\"),\"\",IF($O84=U$19,0,E84-$P84))","v":0},null,{"$f":"IF(OR(G$3=\"\",G$4=\"\"),\"\",IF($O84=W$19,0,G84-$P84))","v":1631.1215654888958},null,{"$f":"IF(OR(I$3=\"\",I$4=\"\"),\"\",IF($O84=Y$19,0,I84-$P84))","v":3497.6923601089375},null,{"$f":"IF(OR(K$3=\"\",K$4=\"\"),\"\",IF($O84=AA$19,0,K84-$P84))","v":1688.0427482795997},null,{"$f":"IF(OR(M$3=\"\",M$4=\"\"),\"\",IF($O84=AC$19,0,M84-$P84))","v":173.0140718883124},null,{"$f":"IF(P84>=$P$3,0,1)","v":0}]
[66,null,2328.1503588576447,null,2191.5133354917152,null,1631.1215654888958,null,3497.6923601089375,null,1688.0427482795997,null,173.0140718883124,null,{"$f":"HLOOKUP(P85,C85:$M$520,A585,0)","v":"F"},173.0140718883124,10.464426539124315,null,2155.1362869693321,null,2018.4992636034028,null,1458.1074936005834,null,3324.6782882206253,null,1515.0286763912873,null,0,null,0]
[67,null,{"$f":"IF(OR(C$3=\"\",C$4=\"\"),\"\",IF(S85=0,C$2+C$4*(LN(1/(1-RAND())))^(1/C$3),S85))","v":2155.1362869693321},null,{"$f":"IF(OR(E$3=\"\",E$4=\"\"),\"\",IF(U85=0,E$2+E$4*(LN(1/(1-RAND())))^(1/E$3),U85))","v":2018.4992636034028},null,{"$f":"IF(OR(G$3=\"\",G$4=\"\"),\"\",IF(W85=0,G$2+G$4*(LN(1/(1-RAND())))^(1/G$3),W85))","v":1458.1074936005834},null,{"$f":"IF(OR(I$3=\"\",I$4=\"\"),\"\",IF(Y85=0,I$2+I$4*(LN(1/(1-RAND())))^(1/I$3),Y85))","v":3324.6782882206253},null,{"$f":"IF(OR(K$3=\"\",K$4=\"\"),\"\",IF(AA85=0,K$2+K$4*(LN(1/(1-RAND())))^(1/K$3),AA85))","v":1515.0286763912873},null,{"$f":"IF(OR(M$3=\"\",M$4=\"\"),\"\",IF(AC85=0,M$2+M$4*(LN(1/(1-RAND())))^(1/M$3),AC85))","v":1944.0602112283052},null,{"$f":"HLOOKUP(P86,C86:$M$520,A586,0)","v":"C"},1458.1074936005834,10.094960802104811,null,697.02879336874867,null,560.39177000281938,null,0,null,1866.5707946200419,null,56.921182790703824,null,485.95271762772177,null,0]
[68,null,697.02879336874867,null,560.39177000281938,null,3950.2415807541161,null,1866.5707946200419,null,56.921182790703824,null,485.95271762772177,null,{"$f":"HLOOKUP(P87,C87:$M$520,A587,0)","v":"E"},56.921182790703824,9.4112582304478174,null,640.10761057804484,null,503.47058721211556,null,3893.3203979634122,null,1809.649611829338,null,0,null,429.03153483701794,null,1]
[69,null,640.10761057804484,null,503.47058721211556,null,3893.3203979634122,null,1809.649611829338,null,2782.3010793484113,null,429.03153483701794,null,{"$f":"HLOOKUP(P88,C88:$M$520,A588,0)","v":"F"},429.03153483701794,9.3296723680765066,null,211.0760757410269,null,74.439052375097617,null,3464.2888631263941,null,1380.6180769923201,null,2353.2695445113932,null,0,null,0]
[70,null,211.0760757410269,null,74.439052375097617,null,3464.2888631263941,null,1380.6180769923201,null,2353.2695445113932,null,2742.2311785083207,null,{"$f":"HLOOKUP(P89,C89:$M$520,A589,0)","v":"B"},74.439052375097617,10.570390559882373,null,136.63702336592928,null,0,null,3389.8498107512964,null,1306.1790246172225,null,2278.8304921362956,null,2667.7921261332231,null,1]
[71,null,136.63702336592928,null,2199.5330336608886,null,3389.8498107512964,null,1306.1790246172225,null,2278.8304921362956,null,2667.7921261332231,null,{"$f":"HLOOKUP(P90,C90:$M$520,A590,0)","v":"A"},136.63702336592928,9.209204400872764,null,0,null,2062.8960102949595,null,3253.2127873853669,null,1169.5420012512932,null,2142.1934687703661,null,2531.155102767294,null,0]
[72,null,2684.8194384594112,null,2062.8960102949595,null,3253.2127873853669,null,1169.5420012512932,null,2142.1934687703661,null,2531.155102767294,null,{"$f":"HLOOKUP(P91,C91:$M$520,A591,0)","v":"D"},1169.5420012512932,8.9831959714889926,null,1515.277437208118,null,893.35400904366634,null,2083.6707861340738,null,0,null,972.65146751907287,null,1361.6131015160008,null,0]
[73,null,1515.277437208118,null,893.35400904366634,null,2083.6707861340738,null,1779.7807333763201,null,972.65146751907287,null,1361.6131015160008,null,{"$f":"HLOOKUP(P92,C92:$M$520,A592,0)","v":"B"},893.35400904366634,10.928175194028203,null,621.92342816445171,null,0,null,1190.3167770904074,null,886.42672433265375,null,79.297458475406529,null,468.25909247233449,null,0]
[74,null,621.92342816445171,null,2329.0038861305452,null,1190.3167770904074,null,886.42672433265375,null,79.297458475406529,null,468.25909247233449,null,{"$f":"HLOOKUP(P93,C93:$M$520,A593,0)","v":"E"},79.297458475406529,11.051440821841494,null,542.62596968904518,null,2249.7064276551387,null,1111.0193186150009,null,807.12926585724722,null,0,null,388.96163399692796,null,1]
[75,null,542.62596968904518,null,2249.7064276551387,null,1111.0193186150009,null,807.12926585724722,null,4213.3836117099809,null,388.96163399692796,null,{"$f":"HLOOKUP(P94,C94:$M$520,A594,0)","v":"F"},388.96163399692796,10.860222831985658,null,153.66433569211722,null,1860.7447936582107,null,722.05768461807293,null,418.16763186031926,null,3824.4219777130529,null,0,null,0]
[76,null,153.66433569211722,null,1860.7447936582107,null,722.05768461807293,null,418.16763186031926,null,3824.4219777130529,null,2317.4430615503757,null,{"$f":"HLOOKUP(P95,C95:$M$520,A595,0)","v":"A"},153.66433569211722,11.051926166237894,null,0,null,1707.0804579660935,null,568.39334892595571,null,264.50329616820204,null,3670.7576420209357,null,2163.7787258582584,null,0]
[77,null,3970.5834145125323,null,1707.0804579660935,null,568.39334892595571,null,264.50329616820204,null,3670.7576420209357,null,2163.7787258582584,null,{"$f":"HLOOKUP(P96,C96:$M$520,A596,0)","v":"D"},264.50329616820204,8.2068034647176926,null,3706.08011834433,null,1442.5771617978914,null,303.89005275775366,null,0,null,3406.2543458527334,null,1899.2754296900564,null,0]
[78,null,3706.08011834433,null,1442.5771617978914,null,303.89005275775366,null,3992.389133404623,null,3406.2543458527334,null,1899.2754296900564,null,{"$f":"HLOOKUP(P97,C97:$M$520,A597,0)","v":"C"},303.89005275775366,9.9628104923781908,null,3402.1900655865766,null,1138.6871090401378,null,0,null,3688.4990806468695,null,3102.36429309498,null,1595.3853769323027,null,0]
[79,null,3402.1900655865766,null,1138.6871090401378,null,3024.7734310070737,null,3688.4990806468695,null,3102.36429309498,null,1595.3853769323027,null,{"$f":"HLOOKUP(P98,C98:$M$520,A598,0)","v":"B"},1138.6871090401378,8.4283096560436892,null,2263.5029565464388,null,0,null,1886.0863219669359,null,2549.8119716067317,null,1963.6771840548422,null,456.69826789216495,null,0]
[80,null,2263.5029565464388,null,1791.6213924697238,null,1886.0863219669359,null,2549.8119716067317,null,1963.6771840548422,null,456.69826789216495,null,{"$f":"HLOOKUP(P99,C99:$M$520,A599,0)","v":"F"},456.69826789216495,10.550963465680155,null,1806.8046886542738,null,1334.9231245775588,null,1429.3880540747709,null,2093.1137037145668,null,1506.9789161626773,null,0,null,0]
[81,null,1806.8046886542738,null,1334.9231245775588,null,1429.3880540747709,null,2093.1137037145668,null,1506.9789161626773,null,2315.0777179266865,null,{"$f":"HLOOKUP(P100,C100:$M$520,A600,0)","v":"B"},1334.9231245775588,8.4966238010418369,null,471.88156407671499,null,0,null,94.464929497212097,null,758.19057913700794,null,172.05579158511841,null,980.15459334912771,null,0]
[82,null,471.88156407671499,null,2346.3393253860927,null,94.464929497212097,null,758.19057913700794,null,172.05579158511841,null,980.15459334912771,null,{"$f":"HLOOKUP(P101,C101:$M$520,A601,0)","v":"C"},94.464929497212097,9.809111130081142,null,377.4166345795029,null,2251.8743958888808,null,0,null,663.72564963979585,null,77.590862087906316,null,885.68966385191561,null,1]
[83,null,377.4166345795029,null,2251.8743958888808,null,5873.0544201898474,null,663.72564963979585,null,77.590862087906316,null,885.68966385191561,null,{"$f":"HLOOKUP(P102,C102:$M$520,A602,0)","v":"E"},77.590862087906316,11.038179382950126,null,299.82577249159658,null,2174.2835338009745,null,5795.4635581019411,null,586.13478755188953,null,0,null,808.09880176400929,null,1]
[84,null,299.82577249159658,null,2174.2835338009745,null,5795.4635581019411,null,586.13478755188953,null,2162.7083682623947,null,808.09880176400929,null,{"$f":"HLOOKUP(P103,C103:$M$520,A603,0)","v":"A"},299.82577249159658,10.239177482890781,null,0,null,1874.4577613093779,null,5495.6377856103445,null,286.30901506029295,null,1862.8825957707982,null,508.27302927241271,null,0]
[85,null,4164.7778732065235,null,1874.4577613093779,null,5495.6377856103445,null,286.30901506029295,null,1862.8825957707982,null,508.27302927241271,null,{"$f":"HLOOKUP(P104,C104:$M$520,A604,0)","v":"D"},286.30901506029295,9.5393827088240677,null,3878.4688581462306,null,1588.148746249085,null,5209.3287705500516,null,0,null,1576.5735807105052,null,221.96401421211976,null,0]
[86,null,3878.4688581462306,null,1588.148746249085,null,5209.3287705500516,null,4088.8373124865839,null,1576.5735807105052,null,221.96401421211976,null,{"$f":"HLOOKUP(P105,C105:$M$520,A605,0)","v":"F"},221.96401421211976,9.4583500054632292,null,3656.5048439341108,null,1366.1847320369652,null,4987.3647563379318,null,3866.8732982744641,null,1354.6095664983854,null,0,null,0]
[87,null,3656.5048439341108,null,1366.1847320369652,null,4987.3647563379318,null,3866.8732982744641,null,1354.6095664983854,null,2701.6373242787772,null,{"$f":"HLOOKUP(P106,C106:$M$520,A606,0)","v":"E"},1354.6095664983854,9.813374458127166,null,2301.8952774357253,null,11.575165538579768,null,3632.7551898395463,null,2512.2637317760787,null,0,null,1347.0277577803918,null,0]
[88,null,2301.8952774357253,null,11.575165538579768,null,3632.7551898395463,null,2512.2637317760787,null,8561.8331859315276,null,1347.0277577803918,null,{"$f":"HLOOKUP(P107,C107:$M$520,A607,0)","v":"B"},11.575165538579768,9.9059320328788907,null,2290.3201118971456,null,0,null,3621.1800243009666,null,2500.6885662374989,null,8550.2580203929483,null,1335.452592241812,null,1]
[89,null,2290.3201118971456,null,2338.7309299879453,null,3621.1800243009666,null,2500.6885662374989,null,8550.2580203929483,null,1335.452592241812,null,{"$f":"HLOOKUP(P108,C108:$M$520,A608,0)","v":"F"},1335.452592241812,9.5176787849213245,null,954.86751965533358,null,1003.2783377461333,null,2285.7274320591546,null,1165.2359739956869,null,7214.8054281511359,null,0,null,0]
[90,null,954.86751965533358,null,1003.2783377461333,null,2285.7274320591546,null,1165.2359739956869,null,7214.8054281511359,null,1820.1848936510316,null,{"$f":"HLOOKUP(P109,C109:$M$520,A609,0)","v":"A"},954.86751965533358,9.3698413189660243,null,0,null,48.410818090799694,null,1330.859912403821,null,210.36845434035331,null,6259.9379084958018,null,865.31737399569806,null,0]
[91,null,1644.7096629988339,null,48.410818090799694,null,1330.859912403821,null,210.36845434035331,null,6259.9379084958018,null,865.31737399569806,null,{"$f":"HLOOKUP(P110,C110:$M$520,A610,0)","v":"B"},48.410818090799694,8.2236764720265594,null,1596.2988449080342,null,0,null,1282.4490943130213,null,161.95763624955362,null,6211.5270904050021,null,816.90655590489837,null,1]
[92,null,1596.2988449080342,null,1983.6311939018042,null,1282.4490943130213,null,161.95763624955362,null,6211.5270904050021,null,816.90655590489837,null,{"$f":"HLOOKUP(P111,C111:$M$520,A611,0)","v":"D"},161.95763624955362,10.372027884775187,null,1434.3412086584806,null,1821.6735576522506,null,1120.4914580634677,null,0,null,6049.5694541554485,null,654.94891965534475,null,0]
[93,null,1434.3412086584806,null,1821.6735576522506,null,1120.4914580634677,null,2817.4606468449447,null,6049.5694541554485,null,654.94891965534475,null,{"$f":"HLOOKUP(P112,C112:$M$520,A612,0)","v":"F"},654.94891965534475,8.9478147475034184,null,779.39228900313583,null,1166.7246379969058,null,465.54253840812294,null,2162.5117271895997,null,5394.6205345001035,null,0,null,0]
[94,null,779.39228900313583,null,1166.7246379969058,null,465.54253840812294,null,2162.5117271895997,null,5394.6205345001035,null,1318.9986149120077,null,{"$f":"HLOOKUP(P113,C113:$M$520,A613,0)","v":"C"},465.54253840812294,9.3477298545173202,null,313.84975059501289,null,701.18209958878288,null,0,null,1696.9691887814768,null,4929.0779960919808,null,853.45607650388479,null,0]
[95,null,313.84975059501289,null,701.18209958878288,null,3457.8251957193925,null,1696.9691887814768,null,4929.0779960919808,null,853.45607650388479,null,{"$f":"HLOOKUP(P114,C114:$M$520,A614,0)","v":"A"},313.84975059501289,10.20642991434044,null,0,null,387.33234899376998,null,3143.9754451243798,null,1383.1194381864639,null,4615.2282454969682,null,539.6063259088719,null,0]
[96,null,3452.6816727698792,null,387.33234899376998,null,3143.9754451243798,null,1383.1194381864639,null,4615.2282454969682,null,539.6063259088719,null,{"$f":"HLOOKUP(P115,C115:$M$520,A615,0)","v":"B"},387.33234899376998,9.0074400506780012,null,3065.3493237761095,null,0,null,2756.6430961306096,null,995.78708919269388,null,4227.8958965031979,null,152.27397691510191,null,0]
[97,null,3065.3493237761095,null,1889.5657764246769,null,2756.6430961306096,null,995.78708919269388,null,4227.8958965031979,null,152.27397691510191,null,{"$f":"HLOOKUP(P116,C116:$M$520,A616,0)","v":"F"},152.27397691510191,9.7031952039340048,null,2913.0753468610073,null,1737.291799509575,null,2604.3691192155075,null,843.51311227759197,null,4075.6219195880958,null,0,null,0]
[98,null,2913.0753468610073,null,1737.291799509575,null,2604.3691192155075,null,843.51311227759197,null,4075.6219195880958,null,2716.6216434327084,null,{"$f":"HLOOKUP(P117,C117:$M$520,A617,0)","v":"D"},843.51311227759197,10.652028474474939,null,2069.5622345834154,null,893.77868723198299,null,1760.8560069379155,null,0,null,3232.1088073105038,null,1873.1085311551165,null,0]
[99,null,2069.5622345834154,null,893.77868723198299,null,1760.8560069379155,null,4967.8033162641968,null,3232.1088073105038,null,1873.1085311551165,null,{"$f":"HLOOKUP(P118,C118:$M$520,A618,0)","v":"B"},893.77868723198299,9.8230376237674992,null,1175.7835473514324,null,0,null,867.0773197059325,null,4074.0246290322139,null,2338.3301200785208,null,979.32984392313347,null,0]
[100,null,1175.7835473514324,null,1964.8826301484446,null,867.0773197059325,null,4074.0246290322139,null,2338.3301200785208,null,979.32984392313347,null,{"$f":"HLOOKUP(P119,C119:$M$520,A619,0)","v":"C"},867.0773197059325,9.5434516628227524,null,308.70622764549989,null,1097.8053104425121,null,0,null,3206.9473093262814,null,1471.2528003725884,null,112.25252421720097,null,0]
[101,null,308.70622764549989,null,1097.8053104425121,null,6180.1317457759224,null,3206.9473093262814,null,1471.2528003725884,null,112.25252421720097,null,{"$f":"HLOOKUP(P120,C120:$M$520,A620,0)","v":"F"},112.25252421720097,10.463400961672825,null,196.45370342829892,null,985.55278622531114,null,6067.8792215587218,null,3094.6947851090804,null,1359.0002761553874,null,0,null,0]
[102,null,196.45370342829892,null,985.55278622531114,null,6067.8792215587218,null,3094.6947851090804,null,1359.0002761553874,null,2259.8045322745033,null,{"$f":"HLOOKUP(P121,C121:$M$520,A621,0)","v":"A"},196.45370342829892,9.7980288614746431,null,0,null,789.09908279701222,null,5871.4255181304234,null,2898.2410816807815,null,1162.5465727270885,null,2063.3508288462044,null,0]
[103,null,2354.3534907199301,null,789.09908279701222,null,5871.4255181304234,null,2898.2410816807815,null,1162.5465727270885,null,2063.3508288462044,null,{"$f":"HLOOKUP(P122,C122:$M$520,A622,0)","v":"B"},789.09908279701222,10.542172443644541,null,1565.2544079229178,null,0,null,5082.3264353334107,null,2109.1419988837692,null,373.44748993007624,null,1274.2517460491922,null,0]
[104,null,1565.2544079229178,null,2610.4421620148282,null,5082.3264353334107,null,2109.1419988837692,null,373.44748993007624,null,1274.2517460491922,null,{"$f":"HLOOKUP(P123,C123:$M$520,A623,0)","v":"E"},373.44748993007624,9.879222040330637,null,1191.8069179928416,null,2236.994672084752,null,4708.878945403334,null,1735.694508953693,null,0,null,900.80425611911596,null,0]
[105,null,1191.8069179928416,null,2236.994672084752,null,4708.878945403334,null,1735.694508953693,null,3642.5550863694593,null,900.80425611911596,null,{"$f":"HLOOKUP(P124,C124:$M$520,A624,0)","v":"F"},900.80425611911596,8.375287663564535,null,291.00266187372563,null,1336.190415965636,null,3808.074689284218,null,834.89025283457704,null,2741.7508302503434,null,0,null,0]
[106,null,291.00266187372563,null,1336.190415965636,null,3808.074689284218,null,834.89025283457704,null,2741.7508302503434,null,2404.9777705566253,null,{"$f":"HLOOKUP(P125,C125:$M$520,A625,0)","v":"A"},291.00266187372563,10.364764551180992,null,0,null,1045.1877540919104,null,3517.0720274104924,null,543.88759096085141,null,2450.7481683766177,null,2113.9751086828996,null,0]
[107,null,3226.1963324383701,null,1045.1877540919104,null,3517.0720274104924,null,543.88759096085141,null,2450.7481683766177,null,2113.9751086828996,null,{"$f":"HLOOKUP(P126,C126:$M$520,A626,0)","v":"D"},543.88759096085141,10.563610311857213,null,2682.3087414775187,null,501.30016313105898,null,2973.184436449641,null,0,null,1906.8605774157663,null,1570.0875177220482,null,0]
[108,null,2682.3087414775187,null,501.30016313105898,null,2973.184436449641,null,1358.7036666097429,null,1906.8605774157663,null,1570.0875177220482,null,{"$f":"HLOOKUP(P127,C127:$M$520,A627,0)","v":"B"},501.30016313105898,9.7334177697619459,null,2181.0085783464597,null,0,null,2471.884273318582,null,857.40350347868389,null,1405.5604142847073,null,1068.7873545909893,null,0]
[109,null,2181.0085783464597,null,2252.5221316307584,null,2471.884273318582,null,857.40350347868389,null,1405.5604142847073,null,1068.7873545909893,null,{"$f":"HLOOKUP(P128,C128:$M$520,A628,0)","v":"D"},857.40350347868389,11.458312706881815,null,1323.6050748677758,null,1395.1186281520745,null,1614.4807698398981,null,0,null,548.15691080602346,null,211.38385111230536,null,0]
[110,null,1323.6050748677758,null,1395.1186281520745,null,1614.4807698398981,null,3747.9535090091904,null,548.15691080602346,null,211.38385111230536,null,{"$f":"HLOOKUP(P129,C129:$M$520,A629,0)","v":"F"},211.38385111230536,10.413063072713351,null,1112.2212237554704,null,1183.7347770397691,null,1403.0969187275928,null,3536.569657896885,null,336.7730596937181,null,0,null,0]
[111,null,1112.2212237554704,null,1183.7347770397691,null,1403.0969187275928,null,3536.569657896885,null,336.7730596937181,null,2219.3822106992006,null,{"$f":"HLOOKUP(P130,C130:$M$520,A630,0)","v":"E"},336.7730596937181,9.3108187645208282,null,775.44816406175232,null,846.96171734605105,null,1066.3238590338747,null,3199.7965982031669,null,0,null,1882.6091510054825,null,0]
[112,null,775.44816406175232,null,846.96171734605105,null,1066.3238590338747,null,3199.7965982031669,null,4183.1524819563328,null,1882.6091510054825,null,{"$f":"HLOOKUP(P131,C131:$M$520,A631,0)","v":"A"},775.44816406175232,9.7131070688274583,null,0,null,71.513553284298723,null,290.87569497212235,null,2424.3484341414146,null,3407.7043178945805,null,1107.1609869437302,null,0]
[113,null,4457.5636831109623,null,71.513553284298723,null,290.87569497212235,null,2424.3484341414146,null,3407.7043178945805,null,1107.1609869437302,null,{"$f":"HLOOKUP(P132,C132:$M$520,A632,0)","v":"B"},71.513553284298723,8.8284835154179966,null,4386.0501298266636,null,0,null,219.36214168782362,null,2352.8348808571159,null,3336.1907646102818,null,1035.6474336594315,null,1]
[114,null,4386.0501298266636,null,2052.2130280266701,null,219.36214168782362,null,2352.8348808571159,null,3336.1907646102818,null,1035.6474336594315,null,{"$f":"HLOOKUP(P133,C133:$M$520,A633,0)","v":"C"},219.36214168782362,9.9953438863091844,null,4166.6879881388395,null,1832.8508863388465,null,0,null,2133.4727391692923,null,3116.8286229224582,null,816.28529197160788,null,0]
[115,null,4166.6879881388395,null,1832.8508863388465,null,2140.8060627660925,null,2133.4727391692923,null,3116.8286229224582,null,816.28529197160788,null,{"$f":"HLOOKUP(P134,C134:$M$520,A634,0)","v":"F"},816.28529197160788,9.0199097754120174,null,3350.4026961672316,null,1016.5655943672386,null,1324.5207707944846,null,1317.1874471976844,null,2300.5433309508503,null,0,null,0]
[116,null,3350.4026961672316,null,1016.5655943672386,null,1324.5207707944846,null,1317.1874471976844,null,2300.5433309508503,null,1463.2431744983267,null,{"$f":"HLOOKUP(P135,C135:$M$520,A635,0)","v":"B"},1016.5655943672386,11.460485415088707,null,2333.837101799993,null,0,null,307.95517642724599,null,300.62185283044573,null,1283.9777365836117,null,446.67758013108801,null,0]
[117,null,2333.837101799993,null,1142.6193111290906,null,307.95517642724599,null,300.62185283044573,null,1283.9777365836117,null,446.67758013108801,null,{"$f":"HLOOKUP(P136,C136:$M$520,A636,0)","v":"D"},300.62185283044573,10.096995159460796,null,2033.2152489695472,null,841.99745829864491,null,7.3333235968002555,null,0,null,983.35588375316593,null,146.05572730064227,null,0]
[118,null,2033.2152489695472,null,841.99745829864491,null,7.3333235968002555,null,2378.0979133095116,null,983.35588375316593,null,146.05572730064227,null,{"$f":"HLOOKUP(P137,C137:$M$520,A637,0)","v":"C"},7.3333235968002555,10.638183364669924,null,2025.881925372747,null,834.66413470184466,null,0,null,2370.7645897127113,null,976.02256015636567,null,138.72240370384202,null,1]
[119,null,2025.881925372747,null,834.66413470184466,null,3612.0271751112746,null,2370.7645897127113,null,976.02256015636567,null,138.72240370384202,null,{"$f":"HLOOKUP(P138,C138:$M$520,A638,0)","v":"F"},138.72240370384202,10.522414999336876,null,1887.159521668905,null,695.94173099800264,null,3473.3047714074328,null,2232.0421860088691,null,837.30015645252365,null,0,null,0]
[120,null,1887.159521668905,null,695.94173099800264,null,3473.3047714074328,null,2232.0421860088691,null,837.30015645252365,null,1313.0619107158341,null,{"$f":"HLOOKUP(P139,C139:$M$520,A639,0)","v":"B"},695.94173099800264,11.168259487156663,null,1191.2177906709023,null,0,null,2777.3630404094301,null,1536.1004550108664,null,141.35842545452101,null,617.12017971783143,null,0]
[121,null,1191.2177906709023,null,2304.4974662743916,null,2777.3630404094301,null,1536.1004550108664,null,141.35842545452101,null,617.12017971783143,null,{"$f":"HLOOKUP(P140,C140:$M$520,A640,0)","v":"E"},141.35842545452101,10.203877679690564,null,1049.8593652163813,null,2163.1390408198704,null,2636.0046149549089,null,1394.7420295563454,null,0,null,475.76175426331042,null,0]
[122,null,1049.8593652163813,null,2163.1390408198704,null,2636.0046149549089,null,1394.7420295563454,null,6670.5519371541222,null,475.76175426331042,null,{"$f":"HLOOKUP(P141,C141:$M$520,A641,0)","v":"F"},475.76175426331042,9.0015013358377711,null,574.0976109530709,null,1687.37728655656,null,2160.2428606915983,null,918.98027529303499,null,6194.7901828908116,null,0,null,0]
[123,null,574.0976109530709,null,1687.37728655656,null,2160.2428606915983,null,918.98027529303499,null,6194.7901828908116,null,2053.7788482215046,null,{"$f":"HLOOKUP(P142,C142:$M$520,A642,0)","v":"A"},574.0976109530709,9.9523333315117863,null,0,null,1113.2796756034891,null,1586.1452497385274,null,344.88266433996409,null,5620.6925719377405,null,1479.6812372684337,null,0]
[124,null,3217.3540648219609,null,1113.2796756034891,null,1586.1452497385274,null,344.88266433996409,null,5620.6925719377405,null,1479.6812372684337,null,{"$f":"HLOOKUP(P143,C143:$M$520,A643,0)","v":"D"},344.88266433996409,8.5535581826210354,null,2872.4714004819971,null,768.39701126352497,null,1241.2625853985633,null,0,null,5275.8099075977761,null,1134.7985729284696,null,0]
[125,null,2872.4714004819971,null,768.39701126352497,null,1241.2625853985633,null,3998.5094078455995,null,5275.8099075977761,null,1134.7985729284696,null,{"$f":"HLOOKUP(P144,C144:$M$520,A644,0)","v":"B"},768.39701126352497,9.9260000858149144,null,2104.0743892184719,null,0,null,472.86557413503829,null,3230.1123965820743,null,4507.4128963342509,null,366.40156166494467,null,0]
[126,null,2104.0743892184719,null,1768.6954590336245,null,472.86557413503829,null,3230.1123965820743,null,4507.4128963342509,null,366.40156166494467,null,{"$f":"HLOOKUP(P145,C145:$M$520,A645,0)","v":"F"},366.40156166494467,8.9183297642771144,null,1737.6728275535272,null,1402.2938973686798,null,106.46401247009362,null,2863.7108349171294,null,4141.0113346693061,null,0,null,0]
[127,null,1737.6728275535272,null,1402.2938973686798,null,106.46401247009362,null,2863.7108349171294,null,4141.0113346693061,null,2954.1723583146331,null,{"$f":"HLOOKUP(P146,C146:$M$520,A646,0)","v":"C"},106.46401247009362,11.438229368919355,null,1631.2088150834336,null,1295.8298848985862,null,0,null,2757.2468224470358,null,4034.5473221992124,null,2847.7083458445395,null,0]
[128,null,1631.2088150834336,null,1295.8298848985862,null,2614.1930349686136,null,2757.2468224470358,null,4034.5473221992124,null,2847.7083458445395,null,{"$f":"HLOOKUP(P147,C147:$M$520,A647,0)","v":"B"},1295.8298848985862,8.4297421759470748,null,335.37893018484738,null,0,null,1318.3631500700274,null,1461.4169375484496,null,2738.7174373006264,null,1551.8784609459533,null,0]
[129,null,335.37893018484738,null,2450.1852282712935,null,1318.3631500700274,null,1461.4169375484496,null,2738.7174373006264,null,1551.8784609459533,null,{"$f":"HLOOKUP(P148,C148:$M$520,A648,0)","v":"A"},{"$f":"MIN(C148:M148)","v":335.37893018484738},{"$f":"IF(O148=C$19,EXP(NORMINV(RAND(),C$8,C$9)),IF(O148=E$19,EXP(NORMINV(RAND(),E$8,E$9)),IF(O148=G$19,EXP(NORMINV(RAND(),G$8,G$9)),IF(O148=I$19,EXP(NORMINV(RAND(),I$8,I$9)),IF(O148=K$19,EXP(NORMINV(RAND(),K$8,K$9)),IF(O148=M$19,EXP(NORMINV(RAND(),M$8,M$9))))))))","v":10.604774819738491},null,{"$f":"IF(OR(C$3=\"\",C$4=\"\"),\"\",IF($O148=S$19,0,C148-$P148))","v":0},null,{"$f":"IF(OR(E$3=\"\",E$4=\"\"),\"\",IF($O148=U$19,0,E148-$P148))","v":2114.8062980864461},null,{"$f":"IF(OR(G$3=\"\",G$4=\"\"),\"\",IF($O148=W$19,0,G148-$P148))","v":982.98421988517998},null,{"$f":"IF(OR(I$3=\"\",I$4=\"\"),\"\",IF($O148=Y$19,0,I148-$P148))","v":1126.0380073636022},null,{"$f":"IF(OR(K$3=\"\",K$4=\"\"),\"\",IF($O148=AA$19,0,K148-$P148))","v":2403.3385071157791},null,{"$f":"IF(OR(M$3=\"\",M$4=\"\"),\"\",IF($O148=AC$19,0,M148-$P148))","v":1216.4995307611059},null,{"$f":"IF(P148>=$P$3,0,1)","v":0}]
[130,null,2319.2445232642694,null,2114.8062980864461,null,982.98421988517998,null,1126.0380073636022,null,2403.3385071157791,null,1216.4995307611059,null,{"$f":"HLOOKUP(P149,C149:$M$520,A649,0)","v":"C"},982.98421988517998,9.291489763846382,null,1336.2603033790895,null,1131.8220782012661,null,0,null,143.05378747842224,null,1420.3542872305991,null,233.51531087592593,null,0]
[131,null,{"$f":"IF(OR(C$3=\"\",C$4=\"\"),\"\",IF(S149=0,C$2+C$4*(LN(1/(1-RAND())))^(1/C$3),S149))","v":1336.2603033790895},null,{"$f":"IF(OR(E$3=\"\",E$4=\"\"),\"\",IF(U149=0,E$2+E$4*(LN(1/(1-RAND())))^(1/E$3),U149))","v":1131.8220782012661},null,{"$f":"IF(OR(G$3=\"\",G$4=\"\"),\"\",IF(W149=0,G$2+G$4*(LN(1/(1-RAND())))^(1/G$3),W149))","v":4461.5648684793869},null,{"$f":"IF(OR(I$3=\"\",I$4=\"\"),\"\",IF(Y149=0,I$2+I$4*(LN(1/(1-RAND())))^(1/I$3),Y149))","v":143.05378747842224},null,{"$f":"IF(OR(K$3=\"\",K$4=\"\"),\"\",IF(AA149=0,K$2+K$4*(LN(1/(1-RAND())))^(1/K$3),AA149))","v":1420.3542872305991},null,{"$f":"IF(OR(M$3=\"\",M$4=\"\"),\"\",IF(AC149=0,M$2+M$4*(LN(1/(1-RAND())))^(1/M$3),AC149))","v":233.51531087592593},null,{"$f":"HLOOKUP(P150,C150:$M$520,A650,0)","v":"D"},143.05378747842224,9.2328806607830654,null,1193.2065159006672,null,988.76829072284386,null,4318.5110810009646,null,0,null,1277.3004997521768,null,90.461523397503697,null,0]
[132,null,1193.2065159006672,null,988.76829072284386,null,4318.5110810009646,null,2731.0473224744014,null,1277.3004997521768,null,90.461523397503697,null,{"$f":"HLOOKUP(P151,C151:$M$520,A651,0)","v":"F"},90.461523397503697,9.3164025264698367,null,1102.7449925031635,null,898.30676732534016,null,4228.0495576034609,null,2640.5857990768977,null,1186.8389763546732,null,0,null,1]
[133,null,1102.7449925031635,null,898.30676732534016,null,4228.0495576034609,null,2640.5857990768977,null,1186.8389763546732,null,2805.2033510376541,null,{"$f":"HLOOKUP(P152,C152:$M$520,A652,0)","v":"B"},898.30676732534016,10.458741221272705,null,204.43822517782337,null,0,null,3329.742790278121,null,1742.2790317515576,null,288.53220902933299,null,1906.8965837123139,null,0]
[134,null,204.43822517782337,null,2095.167656284385,null,3329.742790278121,null,1742.2790317515576,null,288.53220902933299,null,1906.8965837123139,null,{"$f":"HLOOKUP(P153,C153:$M$520,A653,0)","v":"A"},204.43822517782337,10.261743884380378,null,0,null,1890.7294311065616,null,3125.3045651002976,null,1537.8408065737342,null,84.09398385150962,null,1702.4583585344906,null,0]
[135,null,3792.251994353504,null,1890.7294311065616,null,3125.3045651002976,null,1537.8408065737342,null,84.09398385150962,null,1702.4583585344906,null,{"$f":"HLOOKUP(P154,C154:$M$520,A654,0)","v":"E"},84.09398385150962,10.590648842555559,null,3708.1580105019943,null,1806.635447255052,null,3041.210581248788,null,1453.7468227222246,null,0,null,1618.364374682981,null,1]
[136,null,3708.1580105019943,null,1806.635447255052,null,3041.210581248788,null,1453.7468227222246,null,3470.2785362239938,null,1618.364374682981,null,{"$f":"HLOOKUP(P155,C155:$M$520,A655,0)","v":"D"},1453.7468227222246,10.034029053383518,null,2254.4111877797695,null,352.88862453282741,null,1587.4637585265634,null,0,null,2016.5317135017692,null,164.61755196075637,null,0]
[137,null,2254.4111877797695,null,352.88862453282741,null,1587.4637585265634,null,4112.1673920782005,null,2016.5317135017692,null,164.61755196075637,null,{"$f":"HLOOKUP(P156,C156:$M$520,A656,0)","v":"F"},164.61755196075637,10.537930549745619,null,2089.7936358190132,null,188.27107257207103,null,1422.8462065658071,null,3947.5498401174441,null,1851.9141615410128,null,0,null,0]
[138,null,2089.7936358190132,null,188.27107257207103,null,1422.8462065658071,null,3947.5498401174441,null,1851.9141615410128,null,1989.6113209049417,null,{"$f":"HLOOKUP(P157,C157:$M$520,A657,0)","v":"B"},188.27107257207103,8.9739113834661683,null,1901.5225632469421,null,0,null,1234.575133993736,null,3759.2787675453728,null,1663.6430889689418,null,1801.3402483328707,null,0]
[139,null,1901.5225632469421,null,2484.8554072588154,null,1234.575133993736,null,3759.2787675453728,null,1663.6430889689418,null,1801.3402483328707,null,{"$f":"HLOOKUP(P158,C158:$M$520,A658,0)","v":"C"},1234.575133993736,10.684071525162064,null,666.94742925320611,null,1250.2802732650794,null,0,null,2524.7036335516368,null,429.06795497520579,null,566.7651143391347,null,0]
[140,null,666.94742925320611,null,1250.2802732650794,null,3046.0435985755976,null,2524.7036335516368,null,429.06795497520579,null,566.7651143391347,null,{"$f":"HLOOKUP(P159,C159:$M$520,A659,0)","v":"E"},429.06795497520579,9.3180893971603496,null,237.87947427800032,null,821.21231828987356,null,2616.9756436003918,null,2095.635678576431,null,0,null,137.6971593639289,null,0]
[141,null,237.87947427800032,null,821.21231828987356,null,2616.9756436003918,null,2095.635678576431,null,5612.7675870642361,null,137.6971593639289,null,{"$f":"HLOOKUP(P160,C160:$M$520,A660,0)","v":"F"},137.6971593639289,8.7482001139154519,null,100.18231491407141,null,683.51515892594466,null,2479.2784842364626,null,1957.9385192125021,null,5475.0704277003069,null,0,null,0]
[142,null,100.18231491407141,null,683.51515892594466,null,2479.2784842364626,null,1957.9385192125021,null,5475.0704277003069,null,2610.6796677023035,null,{"$f":"HLOOKUP(P161,C161:$M$520,A661,0)","v":"A"},100.18231491407141,10.116832477618411,null,0,null,583.33284401187325,null,2379.0961693223912,null,1857.7562042984307,null,5374.8881127862351,null,2510.4973527882321,null,0]
[143,null,3751.492099679961,null,583.33284401187325,null,2379.0961693223912,null,1857.7562042984307,null,5374.8881127862351,null,2510.4973527882321,null,{"$f":"HLOOKUP(P162,C162:$M$520,A662,0)","v":"B"},583.33284401187325,9.4399310817831097,null,3168.159255668088,null,0,null,1795.763325310518,null,1274.4233602865575,null,4791.555268774362,null,1927.1645087763588,null,0]
[144,null,3168.159255668088,null,1655.1750033276135,null,1795.763325310518,null,1274.4233602865575,null,4791.555268774362,null,1927.1645087763588,null,{"$f":"HLOOKUP(P163,C163:$M$520,A663,0)","v":"D"},1274.4233602865575,10.755782077270057,null,1893.7358953815306,null,380.75164304105601,null,521.33996502396053,null,0,null,3517.1319084878046,null,652.74114848980139,null,0]
[145,null,1893.7358953815306,null,380.75164304105601,null,521.33996502396053,null,4541.9047435054226,null,3517.1319084878046,null,652.74114848980139,null,{"$f":"HLOOKUP(P164,C164:$M$520,A664,0)","v":"B"},380.75164304105601,10.191021555216563,null,1512.9842523404745,null,0,null,140.58832198290452,null,4161.1531004643666,null,3136.3802654467486,null,271.98950544874538,null,0]
[146,null,1512.9842523404745,null,2141.955070331775,null,140.58832198290452,null,4161.1531004643666,null,3136.3802654467486,null,271.98950544874538,null,{"$f":"HLOOKUP(P165,C165:$M$520,A665,0)","v":"C"},140.58832198290452,8.6831137876503526,null,1372.39593035757,null,2001.3667483488705,null,0,null,4020.5647784814619,null,2995.7919434638443,null,131.40118346584086,null,0]
[147,null,1372.39593035757,null,2001.3667483488705,null,4569.7513415493777,null,4020.5647784814619,null,2995.7919434638443,null,131.40118346584086,null,{"$f":"HLOOKUP(P166,C166:$M$520,A666,0)","v":"F"},131.40118346584086,9.088688946108169,null,1240.9947468917292,null,1869.9655648830296,null,4438.3501580835364,null,3889.163595015621,null,2864.3907599980034,null,0,null,0]
[148,null,1240.9947468917292,null,1869.9655648830296,null,4438.3501580835364,null,3889.163595015621,null,2864.3907599980034,null,1860.1545564727753,null,{"$f":"HLOOKUP(P167,C167:$M$520,A667,0)","v":"A"},1240.9947468917292,10.709383055847891,null,0,null,628.97081799130046,null,3197.3554111918074,null,2648.1688481238916,null,1623.3960131062743,null,619.15980958104615,null,0]
[149,null,4834.9548470880691,null,628.97081799130046,null,3197.3554111918074,null,2648.1688481238916,null,1623.3960131062743,null,619.15980958104615,null,{"$f":"HLOOKUP(P168,C168:$M$520,A668,0)","v":"F"},619.15980958104615,11.466499251315346,null,4215.7950375070232,null,9.8110084102543169,null,2578.1956016107615,null,2029.0090385428455,null,1004.2362035252281,null,0,null,0]
[150,null,4215.7950375070232,null,9.8110084102543169,null,2578.1956016107615,null,2029.0090385428455,null,1004.2362035252281,null,2749.7139871526088,null,{"$f":"HLOOKUP(P169,C169:$M$520,A669,0)","v":"B"},9.8110084102543169,10.445131045196369,null,4205.9840290967686,null,0,null,2568.384593200507,null,2019.1980301325912,null,994.4251951149738,null,2739.9029787423542,null,1]
[151,null,4205.9840290967686,null,1764.1273318948233,null,2568.384593200507,null,2019.1980301325912,null,994.4251951149738,null,2739.9029787423542,null,{"$f":"HLOOKUP(P170,C170:$M$520,A670,0)","v":"E"},994.4251951149738,9.2647377392126913,null,3211.558833981795,null,769.70213677984952,null,1573.9593980855332,null,1024.7728350176174,null,0,null,1745.4777836273804,null,0]
[152,null,3211.558833981795,null,769.70213677984952,null,1573.9593980855332,null,1024.7728350176174,null,2390.5119995246791,null,1745.4777836273804,null,{"$f":"HLOOKUP(P171,C171:$M$520,A671,0)","v":"B"},769.70213677984952,8.446941761487734,null,2441.8566972019453,null,0,null,804.25726130568364,null,255.07069823776783,null,1620.8098627448296,null,975.77564684753088,null,0]
[153,null,2441.8566972019453,null,2235.438983713485,null,804.25726130568364,null,255.07069823776783,null,1620.8098627448296,null,975.77564684753088,null,{"$f":"HLOOKUP(P172,C172:$M$520,A672,0)","v":"D"},255.07069823776783,10.102763874365133,null,2186.7859989641775,null,1980.3682854757171,null,549.18656306791581,null,0,null,1365.7391645070618,null,720.70494860976305,null,0]
[154,null,2186.7859989641775,null,1980.3682854757171,null,549.18656306791581,null,3211.2004915826419,null,1365.7391645070618,null,720.70494860976305,null,{"$f":"HLOOKUP(P173,C173:$M$520,A673,0)","v":"C"},549.18656306791581,11.32291364277782,null,1637.5994358962616,null,1431.1817224078013,null,0,null,2662.0139285147261,null,816.55260143914597,null,171.51838554184724,null,0]
[155,null,1637.5994358962616,null,1431.1817224078013,null,5547.6191374068694,null,2662.0139285147261,null,816.55260143914597,null,171.51838554184724,null,{"$f":"HLOOKUP(P174,C174:$M$520,A674,0)","v":"F"},171.51838554184724,9.6254331670044913,null,1466.0810503544144,null,1259.6633368659541,null,5376.1007518650222,null,2490.4955429728789,null,645.03421589729874,null,0,null,0]
[156,null,1466.0810503544144,null,1259.6633368659541,null,5376.1007518650222,null,2490.4955429728789,null,645.03421589729874,null,2367.8621355844989,null,{"$f":"HLOOKUP(P175,C175:$M$520,A675,0)","v":"E"},645.03421589729874,9.9041183489763931,null,821.04683445711566,null,614.62912096865534,null,4731.0665359677232,null,1845.4613270755801,null,0,null,1722.8279196872002,null,0]
[157,null,821.04683445711566,null,614.62912096865534,null,4731.0665359677232,null,1845.4613270755801,null,2445.9594879664232,null,1722.8279196872002,null,{"$f":"HLOOKUP(P176,C176:$M$520,A676,0)","v":"B"},614.62912096865534,9.6779490599201488,null,206.41771348846032,null,0,null,4116.4374149990681,null,1230.8322061069248,null,1831.3303669977679,null,1108.1987987185448,null,0]
[158,null,206.41771348846032,null,2601.9900102647507,null,4116.4374149990681,null,1230.8322061069248,null,1831.3303669977679,null,1108.1987987185448,null,{"$f":"HLOOKUP(P177,C177:$M$520,A677,0)","v":"A"},206.41771348846032,10.945842409573228,null,0,null,2395.5722967762904,null,3910.0197015106078,null,1024.4144926184645,null,1624.9126535093076,null,901.7810852300845,null,0]
[159,null,2797.7149493376837,null,2395.5722967762904,null,3910.0197015106078,null,1024.4144926184645,null,1624.9126535093076,null,901.7810852300845,null,{"$f":"HLOOKUP(P178,C178:$M$520,A678,0)","v":"F"},901.7810852300845,11.572485957543581,null,1895.9338641075992,null,1493.7912115462059,null,3008.2386162805233,null,122.63340738837996,null,723.13156827922307,null,0,null,0]
[160,null,1895.9338641075992,null,1493.7912115462059,null,3008.2386162805233,null,122.63340738837996,null,723.13156827922307,null,2280.9587736869644,null,{"$f":"HLOOKUP(P179,C179:$M$520,A679,0)","v":"D"},122.63340738837996,9.7631112867239835,null,1773.3004567192193,null,1371.1578041578259,null,2885.6052088921433,null,0,null,600.49816089084311,null,2158.3253662985844,null,0]
[161,null,1773.3004567192193,null,1371.1578041578259,null,2885.6052088921433,null,3174.1955483577553,null,600.49816089084311,null,2158.3253662985844,null,{"$f":"HLOOKUP(P180,C180:$M$520,A680,0)","v":"E"},600.49816089084311,10.135480689079817,null,1172.8022958283761,null,770.65964326698281,null,2285.1070480013004,null,2573.697387466912,null,0,null,1557.8272054077413,null,0]
[162,null,1172.8022958283761,null,770.65964326698281,null,2285.1070480013004,null,2573.697387466912,null,4293.2221014478155,null,1557.8272054077413,null,{"$f":"HLOOKUP(P181,C181:$M$520,A681,0)","v":"B"},770.65964326698281,8.8797538549449992,null,402.14265256139333,null,0,null,1514.4474047343176,null,1803.0377441999292,null,3522.5624581808324,null,787.16756214075849,null,0]
[163,null,402.14265256139333,null,2180.4002695897043,null,1514.4474047343176,null,1803.0377441999292,null,3522.5624581808324,null,787.16756214075849,null,{"$f":"HLOOKUP(P182,C182:$M$520,A682,0)","v":"A"},402.14265256139333,9.974943022019259,null,0,null,1778.257617028311,null,1112.3047521729243,null,1400.8950916385359,null,3120.4198056194391,null,385.02490957936516,null,0]
[164,null,4127.3035052570212,null,1778.257617028311,null,1112.3047521729243,null,1400.8950916385359,null,3120.4198056194391,null,385.02490957936516,null,{"$f":"HLOOKUP(P183,C183:$M$520,A683,0)","v":"F"},385.02490957936516,9.8252462833636134,null,3742.2785956776561,null,1393.2327074489458,null,727.27984259355912,null,1015.8701820591707,null,2735.3948960400739,null,0,null,0]
[165,null,3742.2785956776561,null,1393.2327074489458,null,727.27984259355912,null,1015.8701820591707,null,2735.3948960400739,null,3311.314681561103,null,{"$f":"HLOOKUP(P184,C184:$M$520,A684,0)","v":"C"},727.27984259355912,9.6585929659202083,null,3014.9987530840972,null,665.95286485538668,null,0,null,288.59033946561158,null,2008.1150534465148,null,2584.0348389675437,null,0]
[166,null,3014.9987530840972,null,665.95286485538668,null,3010.4004779324564,null,288.59033946561158,null,2008.1150534465148,null,2584.0348389675437,null,{"$f":"HLOOKUP(P185,C185:$M$520,A685,0)","v":"D"},288.59033946561158,10.525513285851485,null,2726.4084136184856,null,377.3625253897751,null,2721.8101384668448,null,0,null,1719.5247139809032,null,2295.4444995019321,null,0]
[167,null,2726.4084136184856,null,377.3625253897751,null,2721.8101384668448,null,2685.8812343587852,null,1719.5247139809032,null,2295.4444995019321,null,{"$f":"HLOOKUP(P186,C186:$M$520,A686,0)","v":"B"},377.3625253897751,10.611660370466582,null,2349.0458882287103,null,0,null,2344.4476130770699,null,2308.5187089690098,null,1342.1621885911281,null,1918.081974112157,null,0]
[168,null,2349.0458882287103,null,1899.6375506775908,null,2344.4476130770699,null,2308.5187089690098,null,1342.1621885911281,null,1918.081974112157,null,{"$f":"HLOOKUP(P187,C187:$M$520,A687,0)","v":"E"},1342.1621885911281,11.18596441338717,null,1006.8836996375821,null,557.47536208646261,null,1002.2854244859418,null,966.35652037788168,null,0,null,575.91978552102887,null,0]
[169,null,1006.8836996375821,null,557.47536208646261,null,1002.2854244859418,null,966.35652037788168,null,3948.6579288988301,null,575.91978552102887,null,{"$f":"HLOOKUP(P188,C188:$M$520,A688,0)","v":"B"},557.47536208646261,9.499834604509056,null,449.40833755111953,null,0,null,444.81006239947919,null,408.88115829141907,null,3391.1825668123674,null,18.444423434566261,null,0]
[170,null,449.40833755111953,null,2086.7854591885216,null,444.81006239947919,null,408.88115829141907,null,3391.1825668123674,null,18.444423434566261,null,{"$f":"HLOOKUP(P189,C189:$M$520,A689,0)","v":"F"},18.444423434566261,9.6044141626614454,null,430.96391411655327,null,2068.3410357539551,null,426.36563896491293,null,390.43673485685281,null,3372.738143377801,null,0,null,1]
[171,null,430.96391411655327,null,2068.3410357539551,null,426.36563896491293,null,390.43673485685281,null,3372.738143377801,null,3009.3636507152419,null,{"$f":"HLOOKUP(P190,C190:$M$520,A690,0)","v":"D"},390.43673485685281,10.520185849933283,null,40.527179259700461,null,1677.9043008971023,null,35.928904108060124,null,0,null,2982.3014085209479,null,2618.9269158583893,null,0]
[172,null,40.527179259700461,null,1677.9043008971023,null,35.928904108060124,null,1707.0772581545693,null,2982.3014085209479,null,2618.9269158583893,null,{"$f":"HLOOKUP(P191,C191:$M$520,A691,0)","v":"C"},35.928904108060124,9.7005570468758524,null,4.5982751516403368,null,1641.9753967890422,null,0,null,1671.1483540465092,null,2946.3725044128878,null,2582.9980117503292,null,1]
[173,null,4.5982751516403368,null,1641.9753967890422,null,5926.2070217716,null,1671.1483540465092,null,2946.3725044128878,null,2582.9980117503292,null,{"$f":"HLOOKUP(P192,C192:$M$520,A692,0)","v":"A"},4.5982751516403368,10.714740652200913,null,0,null,1637.3771216374018,null,5921.6087466199597,null,1666.5500788948689,null,2941.7742292612475,null,2578.3997365986888,null,1]
[174,null,4428.1926322838954,null,1637.3771216374018,null,5921.6087466199597,null,1666.5500788948689,null,2941.7742292612475,null,2578.3997365986888,null,{"$f":"HLOOKUP(P193,C193:$M$520,A693,0)","v":"B"},1637.3771216374018,10.708889890084675,null,2790.8155106464937,null,0,null,4284.2316249825581,null,29.172957257467033,null,1304.3971076238456,null,941.02261496128699,null,0]
[175,null,2790.8155106464937,null,1705.1980474688132,null,4284.2316249825581,null,29.172957257467033,null,1304.3971076238456,null,941.02261496128699,null,{"$f":"HLOOKUP(P194,C194:$M$520,A694,0)","v":"D"},29.172957257467033,10.359000872009252,null,2761.6425533890269,null,1676.0250902113462,null,4255.0586677250913,null,0,null,1275.2241503663786,null,911.84965770381996,null,1]
[176,null,2761.6425533890269,null,1676.0250902113462,null,4255.0586677250913,null,6057.4724022355649,null,1275.2241503663786,null,911.84965770381996,null,{"$f":"HLOOKUP(P195,C195:$M$520,A695,0)","v":"F"},911.84965770381996,8.8008561153405775,null,1849.792895685207,null,764.17543250752624,null,3343.2090100212713,null,5145.6227445317454,null,363.37449266255862,null,0,null,0]
[177,null,1849.792895685207,null,764.17543250752624,null,3343.2090100212713,null,5145.6227445317454,null,363.37449266255862,null,2479.3064654120235,null,{"$f":"HLOOKUP(P196,C196:$M$520,A696,0)","v":"E"},363.37449266255862,10.402833786414256,null,1486.4184030226484,null,400.80093984496762,null,2979.8345173587127,null,4782.2482518691868,null,0,null,2115.9319727494649,null,0]
[178,null,1486.4184030226484,null,400.80093984496762,null,2979.8345173587127,null,4782.2482518691868,null,1968.7333760875053,null,2115.9319727494649,null,{"$f":"HLOOKUP(P197,C197:$M$520,A697,0)","v":"B"},400.80093984496762,9.7416886346127551,null,1085.6174631776807,null,0,null,2579.0335775137451,null,4381.4473120242192,null,1567.9324362425377,null,1715.1310329044973,null,0]
[179,null,1085.6174631776807,null,2010.1034909009986,null,2579.0335775137451,null,4381.4473120242192,null,1567.9324362425377,null,1715.1310329044973,null,{"$f":"HLOOKUP(P198,C198:$M$520,A698,0)","v":"A"},1085.6174631776807,9.50032309723351,null,0,null,924.48602772331787,null,1493.4161143360643,null,3295.8298488465384,null,482.31497306485699,null,629.51356972681651,null,0]
[180,null,3157.9997560849406,null,924.48602772331787,null,1493.4161143360643,null,3295.8298488465384,null,482.31497306485699,null,629.51356972681651,null,{"$f":"HLOOKUP(P199,C199:$M$520,A699,0)","v":"E"},482.31497306485699,8.648858685617375,null,2675.6847830200836,null,442.17105465846089,null,1011.1011412712073,null,2813.5148757816814,null,0,null,147.19859666195953,null,0]
[181,null,2675.6847830200836,null,442.17105465846089,null,1011.1011412712073,null,2813.5148757816814,null,4012.3988843046895,null,147.19859666195953,null,{"$f":"HLOOKUP(P200,C200:$M$520,A700,0)","v":"F"},147.19859666195953,9.9386074197346677,null,2528.4861863581241,null,294.97245799650136,null,863.9025446092478,null,2666.3162791197219,null,3865.20028764273,null,0,null,0]
[182,null,2528.4861863581241,null,294.97245799650136,null,863.9025446092478,null,2666.3162791197219,null,3865.20028764273,null,2282.8404043223809,null,{"$f":"HLOOKUP(P201,C201:$M$520,A701,0)","v":"B"},294.97245799650136,11.938816098127235,null,2233.5137283616227,null,0,null,568.93008661274644,null,2371.3438211232206,null,3570.2278296462287,null,1987.8679463258795,null,0]
[183,null,2233.5137283616227,null,1854.7556483376923,null,568.93008661274644,null,2371.3438211232206,null,3570.2278296462287,null,1987.8679463258795,null,{"$f":"HLOOKUP(P202,C202:$M$520,A702,0)","v":"C"},568.93008661274644,10.428870308605072,null,1664.5836417488763,null,1285.8255617249458,null,0,null,1802.4137345104741,null,3001.2977430334822,null,1418.9378597131331,null,0]
[184,null,1664.5836417488763,null,1285.8255617249458,null,5062.0178577477955,null,1802.4137345104741,null,3001.2977430334822,null,1418.9378597131331,null,{"$f":"HLOOKUP(P203,C203:$M$520,A703,0)","v":"B"},1285.8255617249458,11.090235918595788,null,378.75808002393046,null,0,null,3776.1922960228494,null,516.58817278552829,null,1715.4721813085364,null,133.11229798818727,null,0]
[185,null,378.75808002393046,null,1737.947556051475,null,3776.1922960228494,null,516.58817278552829,null,1715.4721813085364,null,133.11229798818727,null,{"$f":"HLOOKUP(P204,C204:$M$520,A704,0)","v":"F"},133.11229798818727,10.593399155254305,null,245.6457820357432,null,1604.8352580632877,null,3643.0799980346619,null,383.47587479734102,null,1582.3598833203491,null,0,null,0]
[186,null,245.6457820357432,null,1604.8352580632877,null,3643.0799980346619,null,383.47587479734102,null,1582.3598833203491,null,2161.8510723423133,null,{"$f":"HLOOKUP(P205,C205:$M$520,A705,0)","v":"A"},245.6457820357432,9.8715367057804198,null,0,null,1359.1894760275445,null,3397.4342159989187,null,137.83009276159783,null,1336.7141012846059,null,1916.2052903065701,null,0]
[187,null,2785.9761696370379,null,1359.1894760275445,null,3397.4342159989187,null,137.83009276159783,null,1336.7141012846059,null,1916.2052903065701,null,{"$f":"HLOOKUP(P206,C206:$M$520,A706,0)","v":"D"},137.83009276159783,9.1921262136087662,null,2648.14607687544,null,1221.3593832659467,null,3259.6041232373209,null,0,null,1198.8840085230081,null,1778.3751975449723,null,0]
[188,null,2648.14607687544,null,1221.3593832659467,null,3259.6041232373209,null,5008.4171912339052,null,1198.8840085230081,null,1778.3751975449723,null,{"$f":"HLOOKUP(P207,C207:$M$520,A707,0)","v":"E"},1198.8840085230081,9.6275017297868359,null,1449.2620683524319,null,22.475374742938584,null,2060.7201147143128,null,3809.5331827108971,null,0,null,579.49118902196415,null,0]
[189,null,1449.2620683524319,null,22.475374742938584,null,2060.7201147143128,null,3809.5331827108971,null,5637.2858981834133,null,579.49118902196415,null,{"$f":"HLOOKUP(P208,C208:$M$520,A708,0)","v":"B"},22.475374742938584,9.3608027152400002,null,1426.7866936094933,null,0,null,2038.2447399713742,null,3787.0578079679585,null,5614.8105234404748,null,557.01581427902556,null,1]
[190,null,1426.7866936094933,null,1236.8624624885008,null,2038.2447399713742,null,3787.0578079679585,null,5614.8105234404748,null,557.01581427902556,null,{"$f":"HLOOKUP(P209,C209:$M$520,A709,0)","v":"F"},557.01581427902556,9.2681344389815266,null,869.77087933046778,null,679.84664820947523,null,1481.2289256923486,null,3230.041993688933,null,5057.7947091614496,null,0,null,0]
[191,null,869.77087933046778,null,679.84664820947523,null,1481.2289256923486,null,3230.041993688933,null,5057.7947091614496,null,1775.8117811805455,null,{"$f":"HLOOKUP(P210,C210:$M$520,A710,0)","v":"B"},679.84664820947523,8.8424297661053046,null,189.92423112099254,null,0,null,801.38227748287341,null,2550.1953454794575,null,4377.9480609519742,null,1095.9651329710703,null,0]
[192,null,189.92423112099254,null,1829.1786316835846,null,801.38227748287341,null,2550.1953454794575,null,4377.9480609519742,null,1095.9651329710703,null,{"$f":"HLOOKUP(P211,C211:$M$520,A711,0)","v":"A"},189.92423112099254,9.9273899864335071,null,0,null,1639.2544005625921,null,611.45804636188086,null,2360.2711143584647,null,4188.0238298309814,null,906.04090185007772,null,0]
[193,null,4112.8883499603025,null,1639.2544005625921,null,611.45804636188086,null,2360.2711143584647,null,4188.0238298309814,null,906.04090185007772,null,{"$f":"HLOOKUP(P212,C212:$M$520,A712,0)","v":"C"},{"$f":"MIN(C212:M212)","v":611.45804636188086},{"$f":"IF(O212=C$19,EXP(NORMINV(RAND(),C$8,C$9)),IF(O212=E$19,EXP(NORMINV(RAND(),E$8,E$9)),IF(O212=G$19,EXP(NORMINV(RAND(),G$8,G$9)),IF(O212=I$19,EXP(NORMINV(RAND(),I$8,I$9)),IF(O212=K$19,EXP(NORMINV(RAND(),K$8,K$9)),IF(O212=M$19,EXP(NORMINV(RAND(),M$8,M$9))))))))","v":10.226137321122184},null,{"$f":"IF(OR(C$3=\"\",C$4=\"\"),\"\",IF($O212=S$19,0,C212-$P212))","v":3501.4303035984217},null,{"$f":"IF(OR(E$3=\"\",E$4=\"\"),\"\",IF($O212=U$19,0,E212-$P212))","v":1027.7963542007112},null,{"$f":"IF(OR(G$3=\"\",G$4=\"\"),\"\",IF($O212=W$19,0,G212-$P212))","v":0},null,{"$f":"IF(OR(I$3=\"\",I$4=\"\"),\"\",IF($O212=Y$19,0,I212-$P212))","v":1748.8130679965839},null,{"$f":"IF(OR(K$3=\"\",K$4=\"\"),\"\",IF($O212=AA$19,0,K212-$P212))","v":3576.5657834691006},null,{"$f":"IF(OR(M$3=\"\",M$4=\"\"),\"\",IF($O212=AC$19,0,M212-$P212))","v":294.58285548819686},null,{"$f":"IF(P212>=$P$3,0,1)","v":0}]
[194,null,3501.4303035984217,null,1027.7963542007112,null,5583.9615998601575,null,1748.8130679965839,null,3576.5657834691006,null,294.58285548819686,null,{"$f":"HLOOKUP(P213,C213:$M$520,A713,0)","v":"F"},294.58285548819686,10.761651856474472,null,3206.8474481102248,null,733.21349871251437,null,5289.3787443719611,null,1454.230212508387,null,3281.9829279809037,null,0,null,0]
[195,null,{"$f":"IF(OR(C$3=\"\",C$4=\"\"),\"\",IF(S213=0,C$2+C$4*(LN(1/(1-RAND())))^(1/C$3),S213))","v":3206.8474481102248},null,{"$f":"IF(OR(E$3=\"\",E$4=\"\"),\"\",IF(U213=0,E$2+E$4*(LN(1/(1-RAND())))^(1/E$3),U213))","v":733.21349871251437},null,{"$f":"IF(OR(G$3=\"\",G$4=\"\"),\"\",IF(W213=0,G$2+G$4*(LN(1/(1-RAND())))^(1/G$3),W213))","v":5289.3787443719611},null,{"$f":"IF(OR(I$3=\"\",I$4=\"\"),\"\",IF(Y213=0,I$2+I$4*(LN(1/(1-RAND())))^(1/I$3),Y213))","v":1454.230212508387},null,{"$f":"IF(OR(K$3=\"\",K$4=\"\"),\"\",IF(AA213=0,K$2+K$4*(LN(1/(1-RAND())))^(1/K$3),AA213))","v":3281.9829279809037},null,{"$f":"IF(OR(M$3=\"\",M$4=\"\"),\"\",IF(AC213=0,M$2+M$4*(LN(1/(1-RAND())))^(1/M$3),AC213))","v":1522.2279746408947},null,{"$f":"HLOOKUP(P214,C214:$M$520,A714,0)","v":"B"},733.21349871251437,9.5412529919678875,null,2473.6339493977102,null,0,null,4556.1652456594466,null,721.01671379587265,null,2548.7694292683891,null,789.01447592838031,null,0]
[196,null,2473.6339493977102,null,2382.2465250534833,null,4556.1652456594466,null,721.01671379587265,null,2548.7694292683891,null,789.01447592838031,null,{"$f":"HLOOKUP(P215,C215:$M$520,A715,0)","v":"D"},721.01671379587265,9.8359525686788754,null,1752.6172356018376,null,1661.2298112576107,null,3835.1485318635741,null,0,null,1827.7527154725165,null,67.99776213250766,null,0]
[197,null,1752.6172356018376,null,1661.2298112576107,null,3835.1485318635741,null,2046.7503396199829,null,1827.7527154725165,null,67.99776213250766,null,{"$f":"HLOOKUP(P216,C216:$M$520,A716,0)","v":"F"},67.99776213250766,10.742693159542529,null,1684.6194734693299,null,1593.232049125103,null,3767.1507697310662,null,1978.7525774874753,null,1759.7549533400088,null,0,null,1]
[198,null,1684.6194734693299,null,1593.232049125103,null,3767.1507697310662,null,1978.7525774874753,null,1759.7549533400088,null,2801.5749542776589,null,{"$f":"HLOOKUP(P217,C217:$M$520,A717,0)","v":"B"},1593.232049125103,10.539184725137062,null,91.387424344226929,null,0,null,2173.9187206059632,null,385.52052836237226,null,166.52290421490579,null,1208.3429051525559,null,0]
[199,null,91.387424344226929,null,2289.1790539338517,null,2173.9187206059632,null,385.52052836237226,null,166.52290421490579,null,1208.3429051525559,null,{"$f":"HLOOKUP(P218,C218:$M$520,A718,0)","v":"A"},91.387424344226929,9.7671986644296531,null,0,null,2197.7916295896248,null,2082.5312962617363,null,294.13310401814533,null,75.135479870678864,null,1116.955480808329,null,1]
[200,null,3869.7114133454152,null,2197.7916295896248,null,2082.5312962617363,null,294.13310401814533,null,75.135479870678864,null,1116.955480808329,null,{"$f":"HLOOKUP(P219,C219:$M$520,A719,0)","v":"E"},75.135479870678864,9.8552932846868515,null,3794.5759334747363,null,2122.6561497189459,null,2007.3958163910575,null,218.99762414746647,null,0,null,1041.8200009376501,null,1]
[201,null,3794.5759334747363,null,2122.6561497189459,null,2007.3958163910575,null,218.99762414746647,null,6807.0444516777598,null,1041.8200009376501,null,{"$f":"HLOOKUP(P220,C220:$M$520,A720,0)","v":"D"},218.99762414746647,10.297838398522321,null,3575.5783093272698,null,1903.6585255714795,null,1788.398192243591,null,0,null,6588.0468275302937,null,822.82237679018363,null,0]
[202,null,3575.5783093272698,null,1903.6585255714795,null,1788.398192243591,null,4468.0877800726685,null,6588.0468275302937,null,822.82237679018363,null,{"$f":"HLOOKUP(P221,C221:$M$520,A721,0)","v":"F"},822.82237679018363,9.951588209691133,null,2752.7559325370862,null,1080.8361487812958,null,965.57581545340736,null,3645.2654032824848,null,5765.2244507401101,null,0,null,0]
[203,null,2752.7559325370862,null,1080.8361487812958,null,965.57581545340736,null,3645.2654032824848,null,5765.2244507401101,null,2676.8369014973209,null,{"$f":"HLOOKUP(P222,C222:$M$520,A722,0)","v":"C"},965.57581545340736,11.459084218800212,null,1787.1801170836789,null,115.26033332788847,null,0,null,2679.6895878290775,null,4799.6486352867032,null,1711.2610860439136,null,0]
[204,null,1787.1801170836789,null,115.26033332788847,null,3459.1849250768269,null,2679.6895878290775,null,4799.6486352867032,null,1711.2610860439136,null,{"$f":"HLOOKUP(P223,C223:$M$520,A723,0)","v":"B"},115.26033332788847,11.125628887887208,null,1671.9197837557904,null,0,null,3343.9245917489384,null,2564.429254501189,null,4684.3883019588147,null,1596.0007527160251,null,0]
[205,null,1671.9197837557904,null,1418.1921978042828,null,3343.9245917489384,null,2564.429254501189,null,4684.3883019588147,null,1596.0007527160251,null,{"$f":"HLOOKUP(P224,C224:$M$520,A724,0)","v":"B"},1418.1921978042828,9.2957397153364383,null,253.72758595150754,null,0,null,1925.7323939446555,null,1146.2370566969062,null,3266.1961041545319,null,177.80855491174225,null,0]
[206,null,253.72758595150754,null,2617.8675373519027,null,1925.7323939446555,null,1146.2370566969062,null,3266.1961041545319,null,177.80855491174225,null,{"$f":"HLOOKUP(P225,C225:$M$520,A725,0)","v":"F"},177.80855491174225,9.3578731443620793,null,75.919031039765287,null,2440.0589824401604,null,1747.9238390329133,null,968.42850178516392,null,3088.3875492427896,null,0,null,0]
[207,null,75.919031039765287,null,2440.0589824401604,null,1747.9238390329133,null,968.42850178516392,null,3088.3875492427896,null,2840.4019965003322,null,{"$f":"HLOOKUP(P226,C226:$M$520,A726,0)","v":"A"},75.919031039765287,9.9129179378462915,null,0,null,2364.1399514003951,null,1672.004807993148,null,892.50947074539863,null,3012.4685182030244,null,2764.4829654605669,null,1]
[208,null,2599.6477669014062,null,2364.1399514003951,null,1672.004807993148,null,892.50947074539863,null,3012.4685182030244,null,2764.4829654605669,null,{"$f":"HLOOKUP(P227,C227:$M$520,A727,0)","v":"D"},892.50947074539863,9.5341247372751461,null,1707.1382961560075,null,1471.6304806549965,null,779.49533724774938,null,0,null,2119.9590474576257,null,1871.9734947151683,null,0]
[209,null,1707.1382961560075,null,1471.6304806549965,null,779.49533724774938,null,5194.1915680583661,null,2119.9590474576257,null,1871.9734947151683,null,{"$f":"HLOOKUP(P228,C228:$M$520,A728,0)","v":"C"},779.49533724774938,9.6720032483132865,null,927.64295890825815,null,692.13514340724714,null,0,null,4414.6962308106167,null,1340.4637102098764,null,1092.4781574674189,null,0]
[210,null,927.64295890825815,null,692.13514340724714,null,5208.9826368696122,null,4414.6962308106167,null,1340.4637102098764,null,1092.4781574674189,null,{"$f":"HLOOKUP(P229,C229:$M$520,A729,0)","v":"B"},692.13514340724714,10.19371033428736,null,235.50781550101101,null,0,null,4516.8474934623646,null,3722.5610874033696,null,648.32856680262921,null,400.34301406017175,null,0]
[211,null,235.50781550101101,null,1971.9477082408227,null,4516.8474934623646,null,3722.5610874033696,null,648.32856680262921,null,400.34301406017175,null,{"$f":"HLOOKUP(P230,C230:$M$520,A730,0)","v":"A"},235.50781550101101,11.548368522052035,null,0,null,1736.4398927398117,null,4281.339677961354,null,3487.0532719023586,null,412.8207513016182,null,164.83519855916074,null,0]
[212,null,4675.7962090942037,null,1736.4398927398117,null,4281.339677961354,null,3487.0532719023586,null,412.8207513016182,null,164.83519855916074,null,{"$f":"HLOOKUP(P231,C231:$M$520,A731,0)","v":"F"},164.83519855916074,9.313843950055249,null,4510.961010535043,null,1571.604694180651,null,4116.5044794021933,null,3322.2180733431978,null,247.98555274245746,null,0,null,0]
[213,null,4510.961010535043,null,1571.604694180651,null,4116.5044794021933,null,3322.2180733431978,null,247.98555274245746,null,2419.012260768729,null,{"$f":"HLOOKUP(P232,C232:$M$520,A732,0)","v":"E"},247.98555274245746,9.6908860881269909,null,4262.9754577925851,null,1323.6191414381935,null,3868.5189266597358,null,3074.2325206007404,null,0,null,2171.0267080262715,null,0]
[214,null,4262.9754577925851,null,1323.6191414381935,null,3868.5189266597358,null,3074.2325206007404,null,5004.6709937642754,null,2171.0267080262715,null,{"$f":"HLOOKUP(P233,C233:$M$520,A733,0)","v":"B"},1323.6191414381935,10.369781769607009,null,2939.3563163543913,null,0,null,2544.8997852215425,null,1750.6133791625468,null,3681.0518523260816,null,847.407566588078,null,0]
[215,null,2939.3563163543913,null,1970.7003746157673,null,2544.8997852215425,null,1750.6133791625468,null,3681.0518523260816,null,847.407566588078,null,{"$f":"HLOOKUP(P234,C234:$M$520,A734,0)","v":"F"},847.407566588078,12.238106991239446,null,2091.9487497663131,null,1123.2928080276893,null,1697.4922186334645,null,903.20581257446884,null,2833.6442857380034,null,0,null,0]
[216,null,2091.9487497663131,null,1123.2928080276893,null,1697.4922186334645,null,903.20581257446884,null,2833.6442857380034,null,2762.4741673968369,null,{"$f":"HLOOKUP(P235,C235:$M$520,A735,0)","v":"D"},903.20581257446884,10.535559720438751,null,1188.7429371918442,null,220.08699545322042,null,794.28640605899568,null,0,null,1930.4384731635346,null,1859.2683548223681,null,0]
[217,null,1188.7429371918442,null,220.08699545322042,null,794.28640605899568,null,2270.3725988273527,null,1930.4384731635346,null,1859.2683548223681,null,{"$f":"HLOOKUP(P236,C236:$M$520,A736,0)","v":"B"},220.08699545322042,10.577116580328205,null,968.65594173862382,null,0,null,574.19941060577526,null,2050.2856033741323,null,1710.3514777103142,null,1639.1813593691477,null,0]
[218,null,968.65594173862382,null,1871.1405131804822,null,574.19941060577526,null,2050.2856033741323,null,1710.3514777103142,null,1639.1813593691477,null,{"$f":"HLOOKUP(P237,C237:$M$520,A737,0)","v":"C"},574.19941060577526,9.1196693093312131,null,394.45653113284857,null,1296.941102574707,null,0,null,1476.086192768357,null,1136.1520671045389,null,1064.9819487633724,null,0]
[219,null,394.45653113284857,null,1296.941102574707,null,3526.7456459171635,null,1476.086192768357,null,1136.1520671045389,null,1064.9819487633724,null,{"$f":"HLOOKUP(P238,C238:$M$520,A738,0)","v":"A"},394.45653113284857,10.237632222699425,null,0,null,902.48457144185841,null,3132.2891147843147,null,1081.6296616355085,null,741.69553597169033,null,670.52541763052386,null,0]
[220,null,4660.5927953572764,null,902.48457144185841,null,3132.2891147843147,null,1081.6296616355085,null,741.69553597169033,null,670.52541763052386,null,{"$f":"HLOOKUP(P239,C239:$M$520,A739,0)","v":"F"},670.52541763052386,10.271995895905658,null,3990.0673777267525,null,231.95915381133455,null,2461.7636971537909,null,411.10424400498459,null,71.170118341166472,null,0,null,0]
[221,null,3990.0673777267525,null,231.95915381133455,null,2461.7636971537909,null,411.10424400498459,null,71.170118341166472,null,1531.4778955425938,null,{"$f":"HLOOKUP(P240,C240:$M$520,A740,0)","v":"E"},71.170118341166472,8.8102991349384343,null,3918.897259385586,null,160.78903547016807,null,2390.5935788126244,null,339.93412566381812,null,0,null,1460.3077772014274,null,1]
[222,null,3918.897259385586,null,160.78903547016807,null,2390.5935788126244,null,339.93412566381812,null,2535.0963305826767,null,1460.3077772014274,null,{"$f":"HLOOKUP(P241,C241:$M$520,A741,0)","v":"B"},160.78903547016807,9.8467356802499708,null,3758.108223915418,null,0,null,2229.8045433424563,null,179.14509019365005,null,2374.3072951125087,null,1299.5187417312593,null,0]
[223,null,3758.108223915418,null,2009.3262728240691,null,2229.8045433424563,null,179.14509019365005,null,2374.3072951125087,null,1299.5187417312593,null,{"$f":"HLOOKUP(P242,C242:$M$520,A742,0)","v":"D"},179.14509019365005,10.185511146183716,null,3578.9631337217679,null,1830.181182630419,null,2050.6594531488063,null,0,null,2195.1622049188586,null,1120.3736515376092,null,0]
[224,null,3578.9631337217679,null,1830.181182630419,null,2050.6594531488063,null,3560.7543320482873,null,2195.1622049188586,null,1120.3736515376092,null,{"$f":"HLOOKUP(P243,C243:$M$520,A743,0)","v":"F"},1120.3736515376092,9.5887112161065673,null,2458.5894821841584,null,709.80753109280977,null,930.28580161119703,null,2440.3806805106778,null,1074.7885533812494,null,0,null,0]
[225,null,2458.5894821841584,null,709.80753109280977,null,930.28580161119703,null,2440.3806805106778,null,1074.7885533812494,null,2019.2703586909772,null,{"$f":"HLOOKUP(P244,C244:$M$520,A744,0)","v":"B"},709.80753109280977,10.367505126335784,null,1748.7819510913487,null,0,null,220.47827051838726,null,1730.5731494178681,null,364.98102228843959,null,1309.4628275981675,null,0]
[226,null,1748.7819510913487,null,1870.8836253657655,null,220.47827051838726,null,1730.5731494178681,null,364.98102228843959,null,1309.4628275981675,null,{"$f":"HLOOKUP(P245,C245:$M$520,A745,0)","v":"C"},220.47827051838726,10.7879162420789,null,1528.3036805729614,null,1650.4053548473782,null,0,null,1510.0948788994808,null,144.50275177005233,null,1088.9845570797802,null,0]
[227,null,1528.3036805729614,null,1650.4053548473782,null,6486.1352481962476,null,1510.0948788994808,null,144.50275177005233,null,1088.9845570797802,null,{"$f":"HLOOKUP(P246,C246:$M$520,A746,0)","v":"E"},144.50275177005233,10.215213638377408,null,1383.8009288029091,null,1505.9026030773259,null,6341.6324964261948,null,1365.5921271294285,null,0,null,944.48180530972786,null,0]
[228,null,1383.8009288029091,null,1505.9026030773259,null,6341.6324964261948,null,1365.5921271294285,null,5747.4001086442386,null,944.48180530972786,null,{"$f":"HLOOKUP(P247,C247:$M$520,A747,0)","v":"F"},944.48180530972786,9.1672283172693074,null,439.31912349318122,null,561.42079776759806,null,5397.150691116467,null,421.11032181970063,null,4802.9183033345107,null,0,null,0]
[229,null,439.31912349318122,null,561.42079776759806,null,5397.150691116467,null,421.11032181970063,null,4802.9183033345107,null,1769.7474848249826,null,{"$f":"HLOOKUP(P248,C248:$M$520,A748,0)","v":"D"},421.11032181970063,9.4174319490043406,null,18.208801673480593,null,140.31047594789743,null,4976.0403692967666,null,0,null,4381.8079815148103,null,1348.637163005282,null,0]
[230,null,18.208801673480593,null,140.31047594789743,null,4976.0403692967666,null,2559.8728441748995,null,4381.8079815148103,null,1348.637163005282,null,{"$f":"HLOOKUP(P249,C249:$M$520,A749,0)","v":"A"},18.208801673480593,11.483255827490773,null,0,null,122.10167427441684,null,4957.831567623286,null,2541.6640425014189,null,4363.5991798413297,null,1330.4283613318014,null,1]
[231,null,4303.5819355238164,null,122.10167427441684,null,4957.831567623286,null,2541.6640425014189,null,4363.5991798413297,null,1330.4283613318014,null,{"$f":"HLOOKUP(P250,C250:$M$520,A750,0)","v":"B"},122.10167427441684,10.234176878850118,null,4181.4802612493995,null,0,null,4835.7298933488692,null,2419.562368227002,null,4241.4975055669129,null,1208.3266870573846,null,0]
[232,null,4181.4802612493995,null,1762.4871440509773,null,4835.7298933488692,null,2419.562368227002,null,4241.4975055669129,null,1208.3266870573846,null,{"$f":"HLOOKUP(P251,C251:$M$520,A751,0)","v":"F"},1208.3266870573846,9.7165650831438217,null,2973.1535741920152,null,554.16045699359279,null,3627.4032062914848,null,1211.2356811696175,null,3033.1708185095285,null,0,null,0]
[233,null,2973.1535741920152,null,554.16045699359279,null,3627.4032062914848,null,1211.2356811696175,null,3033.1708185095285,null,1749.5110947949888,null,{"$f":"HLOOKUP(P252,C252:$M$520,A752,0)","v":"B"},554.16045699359279,9.6104592058384579,null,2418.9931171984226,null,0,null,3073.2427492978923,null,657.07522417602468,null,2479.010361515936,null,1195.350637801396,null,0]
[234,null,2418.9931171984226,null,2600.160000617122,null,3073.2427492978923,null,657.07522417602468,null,2479.010361515936,null,1195.350637801396,null,{"$f":"HLOOKUP(P253,C253:$M$520,A753,0)","v":"D"},657.07522417602468,10.460812595824981,null,1761.9178930223979,null,1943.0847764410973,null,2416.1675251218676,null,0,null,1821.9351373399113,null,538.27541362537136,null,0]
[235,null,1761.9178930223979,null,1943.0847764410973,null,2416.1675251218676,null,5040.6683368011581,null,1821.9351373399113,null,538.27541362537136,null,{"$f":"HLOOKUP(P254,C254:$M$520,A754,0)","v":"F"},538.27541362537136,11.04729372391018,null,1223.6424793970266,null,1404.809362815726,null,1877.8921114964962,null,4502.3929231757866,null,1283.65972371454,null,0,null,0]
[236,null,1223.6424793970266,null,1404.809362815726,null,1877.8921114964962,null,4502.3929231757866,null,1283.65972371454,null,3007.8583485773984,null,{"$f":"HLOOKUP(P255,C255:$M$520,A755,0)","v":"A"},1223.6424793970266,10.19550787875953,null,0,null,181.1668834186994,null,654.24963209946964,null,3278.7504437787602,null,60.017244317513359,null,1784.2158691803718,null,0]
[237,null,3572.8232685920825,null,181.1668834186994,null,654.24963209946964,null,3278.7504437787602,null,60.017244317513359,null,1784.2158691803718,null,{"$f":"HLOOKUP(P256,C256:$M$520,A756,0)","v":"E"},60.017244317513359,12.260628603050586,null,3512.8060242745692,null,121.14963910118604,null,594.23238778195628,null,3218.7331994612468,null,0,null,1724.1986248628584,null,1]
[238,null,3512.8060242745692,null,121.14963910118604,null,594.23238778195628,null,3218.7331994612468,null,3590.9214862584113,null,1724.1986248628584,null,{"$f":"HLOOKUP(P257,C257:$M$520,A757,0)","v":"B"},121.14963910118604,9.3364805186640023,null,3391.6563851733831,null,0,null,473.08274868077024,null,3097.5835603600608,null,3469.7718471572252,null,1603.0489857616724,null,0]
[239,null,3391.6563851733831,null,2130.7914948399448,null,473.08274868077024,null,3097.5835603600608,null,3469.7718471572252,null,1603.0489857616724,null,{"$f":"HLOOKUP(P258,C258:$M$520,A758,0)","v":"C"},473.08274868077024,10.07457641909353,null,2918.5736364926129,null,1657.7087461591746,null,0,null,2624.5008116792906,null,2996.689098476455,null,1129.9662370809021,null,0]
[240,null,2918.5736364926129,null,1657.7087461591746,null,4024.3290236894213,null,2624.5008116792906,null,2996.689098476455,null,1129.9662370809021,null,{"$f":"HLOOKUP(P259,C259:$M$520,A759,0)","v":"F"},1129.9662370809021,9.4708933512273603,null,1788.6073994117107,null,527.74250907827241,null,2894.3627866085189,null,1494.5345745983884,null,1866.7228613955529,null,0,null,0]
[241,null,1788.6073994117107,null,527.74250907827241,null,2894.3627866085189,null,1494.5345745983884,null,1866.7228613955529,null,1835.5072598041961,null,{"$f":"HLOOKUP(P260,C260:$M$520,A760,0)","v":"B"},527.74250907827241,9.6876323846431145,null,1260.8648903334383,null,0,null,2366.6202775302463,null,966.79206552011601,null,1338.9803523172804,null,1307.7647507259237,null,0]
[242,null,1260.8648903334383,null,1817.395224705715,null,2366.6202775302463,null,966.79206552011601,null,1338.9803523172804,null,1307.7647507259237,null,{"$f":"HLOOKUP(P261,C261:$M$520,A761,0)","v":"D"},966.79206552011601,12.182256502675468,null,294.07282481332231,null,850.603159185599,null,1399.8282120101303,null,0,null,372.18828679716444,null,340.97268520580769,null,0]
[243,null,294.07282481332231,null,850.603159185599,null,1399.8282120101303,null,6205.4022349869629,null,372.18828679716444,null,340.97268520580769,null,{"$f":"HLOOKUP(P262,C262:$M$520,A762,0)","v":"A"},294.07282481332231,10.448067933545254,null,0,null,556.53033437227668,null,1105.755387196808,null,5911.329410173641,null,78.115461983842124,null,46.89986039248538,null,0]
[244,null,3467.0742115962998,null,556.53033437227668,null,1105.755387196808,null,5911.329410173641,null,78.115461983842124,null,46.89986039248538,null,{"$f":"HLOOKUP(P263,C263:$M$520,A763,0)","v":"F"},46.89986039248538,9.3172505244061039,null,3420.1743512038147,null,509.6304739797913,null,1058.8555268043226,null,5864.4295497811554,null,31.215601591356744,null,0,null,1]
[245,null,3420.1743512038147,null,509.6304739797913,null,1058.8555268043226,null,5864.4295497811554,null,31.215601591356744,null,1866.0871718178562,null,{"$f":"HLOOKUP(P264,C264:$M$520,A764,0)","v":"E"},31.215601591356744,10.406997395781032,null,3388.9587496124577,null,478.41487238843456,null,1027.6399252129659,null,5833.2139481897984,null,0,null,1834.8715702264994,null,1]
[246,null,3388.9587496124577,null,478.41487238843456,null,1027.6399252129659,null,5833.2139481897984,null,5915.7875432328419,null,1834.8715702264994,null,{"$f":"HLOOKUP(P265,C265:$M$520,A765,0)","v":"B"},478.41487238843456,9.5436111974922682,null,2910.5438772240232,null,0,null,549.2250528245313,null,5354.7990758013639,null,5437.3726708444074,null,1356.4566978380649,null,0]
[247,null,2910.5438772240232,null,1572.4906695524755,null,549.2250528245313,null,5354.7990758013639,null,5437.3726708444074,null,1356.4566978380649,null,{"$f":"HLOOKUP(P266,C266:$M$520,A766,0)","v":"C"},549.2250528245313,9.8595550309213777,null,2361.3188243994919,null,1023.2656167279442,null,0,null,4805.5740229768326,null,4888.1476180198761,null,807.23164501353358,null,0]
[248,null,2361.3188243994919,null,1023.2656167279442,null,2587.7400869877265,null,4805.5740229768326,null,4888.1476180198761,null,807.23164501353358,null,{"$f":"HLOOKUP(P267,C267:$M$520,A767,0)","v":"F"},807.23164501353358,9.2680433000390838,null,1554.0871793859583,null,216.03397171441065,null,1780.5084419741929,null,3998.342377963299,null,4080.9159730063425,null,0,null,0]
[249,null,1554.0871793859583,null,216.03397171441065,null,1780.5084419741929,null,3998.342377963299,null,4080.9159730063425,null,1615.304891905238,null,{"$f":"HLOOKUP(P268,C268:$M$520,A768,0)","v":"B"},216.03397171441065,9.7750635538658468,null,1338.0532076715476,null,0,null,1564.4744702597823,null,3782.3084062488883,null,3864.8820012919318,null,1399.2709201908274,null,0]
[250,null,1338.0532076715476,null,2384.9293010441115,null,1564.4744702597823,null,3782.3084062488883,null,3864.8820012919318,null,1399.2709201908274,null,{"$f":"HLOOKUP(P269,C269:$M$520,A769,0)","v":"A"},1338.0532076715476,9.4116104002210381,null,0,null,1046.8760933725639,null,226.42126258823464,null,2444.2551985773407,null,2526.8287936203842,null,61.217712519279758,null,0]
[251,null,3371.5561892870978,null,1046.8760933725639,null,226.42126258823464,null,2444.2551985773407,null,2526.8287936203842,null,61.217712519279758,null,{"$f":"HLOOKUP(P270,C270:$M$520,A770,0)","v":"F"},61.217712519279758,7.9601954805886477,null,3310.3384767678181,null,985.65838085328414,null,165.20355006895488,null,2383.0374860580609,null,2465.6110811011044,null,0,null,1]
[252,null,3310.3384767678181,null,985.65838085328414,null,165.20355006895488,null,2383.0374860580609,null,2465.6110811011044,null,1638.1983304590383,null,{"$f":"HLOOKUP(P271,C271:$M$520,A771,0)","v":"C"},165.20355006895488,9.4540915770055332,null,3145.1349266988632,null,820.45483078432926,null,0,null,2217.8339359891061,null,2300.4075310321496,null,1472.9947803900834,null,0]
[253,null,3145.1349266988632,null,820.45483078432926,null,3170.0030040268584,null,2217.8339359891061,null,2300.4075310321496,null,1472.9947803900834,null,{"$f":"HLOOKUP(P272,C272:$M$520,A772,0)","v":"B"},820.45483078432926,10.566973539883421,null,2324.6800959145339,null,0,null,2349.5481732425292,null,1397.3791052047768,null,1479.9527002478203,null,652.53994960575415,null,0]
[254,null,2324.6800959145339,null,2009.8306977168622,null,2349.5481732425292,null,1397.3791052047768,null,1479.9527002478203,null,652.53994960575415,null,{"$f":"HLOOKUP(P273,C273:$M$520,A773,0)","v":"F"},652.53994960575415,9.1882320785262692,null,1672.1401463087798,null,1357.2907481111081,null,1697.008223636775,null,744.83915559902266,null,827.41275064206616,null,0,null,0]
[255,null,1672.1401463087798,null,1357.2907481111081,null,1697.008223636775,null,744.83915559902266,null,827.41275064206616,null,2817.4832992494139,null,{"$f":"HLOOKUP(P274,C274:$M$520,A774,0)","v":"D"},744.83915559902266,9.7785971444944302,null,927.30099070975712,null,612.45159251208543,null,952.16906803775237,null,0,null,82.573595043043497,null,2072.644143650391,null,0]
[256,null,927.30099070975712,null,612.45159251208543,null,952.16906803775237,null,3320.6301744787811,null,82.573595043043497,null,2072.644143650391,null,{"$f":"HLOOKUP(P275,C275:$M$520,A775,0)","v":"E"},82.573595043043497,11.239266781883499,null,844.72739566671362,null,529.87799746904193,null,869.59547299470887,null,3238.0565794357376,null,0,null,1990.0705486073475,null,1]
[257,null,844.72739566671362,null,529.87799746904193,null,869.59547299470887,null,3238.0565794357376,null,6411.8784875011006,null,1990.0705486073475,null,{"$f":"HLOOKUP(P276,C276:$M$520,A776,0)","v":"B"},{"$f":"MIN(C276:M276)","v":529.87799746904193},{"$f":"IF(O276=C$19,EXP(NORMINV(RAND(),C$8,C$9)),IF(O276=E$19,EXP(NORMINV(RAND(),E$8,E$9)),IF(O276=G$19,EXP(NORMINV(RAND(),G$8,G$9)),IF(O276=I$19,EXP(NORMINV(RAND(),I$8,I$9)),IF(O276=K$19,EXP(NORMINV(RAND(),K$8,K$9)),IF(O276=M$19,EXP(NORMINV(RAND(),M$8,M$9))))))))","v":9.6667265030417813},null,{"$f":"IF(OR(C$3=\"\",C$4=\"\"),\"\",IF($O276=S$19,0,C276-$P276))","v":314.84939819767169},null,{"$f":"IF(OR(E$3=\"\",E$4=\"\"),\"\",IF($O276=U$19,0,E276-$P276))","v":0},null,{"$f":"IF(OR(G$3=\"\",G$4=\"\"),\"\",IF($O276=W$19,0,G276-$P276))","v":339.71747552566694},null,{"$f":"IF(OR(I$3=\"\",I$4=\"\"),\"\",IF($O276=Y$19,0,I276-$P276))","v":2708.1785819666957},null,{"$f":"IF(OR(K$3=\"\",K$4=\"\"),\"\",IF($O276=AA$19,0,K276-$P276))","v":5882.0004900320582},null,{"$f":"IF(OR(M$3=\"\",M$4=\"\"),\"\",IF($O276=AC$19,0,M276-$P276))","v":1460.1925511383056},null,{"$f":"IF(P276>=$P$3,0,1)","v":0}]
[258,null,314.84939819767169,null,1827.064989004223,null,339.71747552566694,null,2708.1785819666957,null,5882.0004900320582,null,1460.1925511383056,null,{"$f":"HLOOKUP(P277,C277:$M$520,A777,0)","v":"A"},314.84939819767169,9.6078287195949112,null,0,null,1512.2155908065513,null,24.868077327995252,null,2393.329183769024,null,5567.1510918343865,null,1145.3431529406339,null,0]
[259,null,{"$f":"IF(OR(C$3=\"\",C$4=\"\"),\"\",IF(S277=0,C$2+C$4*(LN(1/(1-RAND())))^(1/C$3),S277))","v":2641.020100699076},null,{"$f":"IF(OR(E$3=\"\",E$4=\"\"),\"\",IF(U277=0,E$2+E$4*(LN(1/(1-RAND())))^(1/E$3),U277))","v":1512.2155908065513},null,{"$f":"IF(OR(G$3=\"\",G$4=\"\"),\"\",IF(W277=0,G$2+G$4*(LN(1/(1-RAND())))^(1/G$3),W277))","v":24.868077327995252},null,{"$f":"IF(OR(I$3=\"\",I$4=\"\"),\"\",IF(Y277=0,I$2+I$4*(LN(1/(1-RAND())))^(1/I$3),Y277))","v":2393.329183769024},null,{"$f":"IF(OR(K$3=\"\",K$4=\"\"),\"\",IF(AA277=0,K$2+K$4*(LN(1/(1-RAND())))^(1/K$3),AA277))","v":5567.1510918343865},null,{"$f":"IF(OR(M$3=\"\",M$4=\"\"),\"\",IF(AC277=0,M$2+M$4*(LN(1/(1-RAND())))^(1/M$3),AC277))","v":1145.3431529406339},null,{"$f":"HLOOKUP(P278,C278:$M$520,A778,0)","v":"C"},24.868077327995252,9.2236451585384316,null,2616.1520233710808,null,1487.347513478556,null,0,null,2368.4611064410287,null,5542.2830145063908,null,1120.4750756126386,null,1]
[260,null,2616.1520233710808,null,1487.347513478556,null,4127.6588258183729,null,2368.4611064410287,null,5542.2830145063908,null,1120.4750756126386,null,{"$f":"HLOOKUP(P279,C279:$M$520,A779,0)","v":"F"},1120.4750756126386,10.686615176200446,null,1495.6769477584421,null,366.87243786591739,null,3007.1837502057342,null,1247.9860308283901,null,4421.8079388937522,null,0,null,0]
[261,null,1495.6769477584421,null,366.87243786591739,null,3007.1837502057342,null,1247.9860308283901,null,4421.8079388937522,null,1717.5347867795117,null,{"$f":"HLOOKUP(P280,C280:$M$520,A780,0)","v":"B"},366.87243786591739,8.9709091485047505,null,1128.8045098925247,null,0,null,2640.3113123398171,null,881.11359296247269,null,4054.935501027835,null,1350.6623489135943,null,0]
[262,null,1128.8045098925247,null,2241.5470682609948,null,2640.3113123398171,null,881.11359296247269,null,4054.935501027835,null,1350.6623489135943,null,{"$f":"HLOOKUP(P281,C281:$M$520,A781,0)","v":"D"},881.11359296247269,10.082709207285193,null,247.69091693005203,null,1360.4334752985221,null,1759.1977193773444,null,0,null,3173.8219080653625,null,469.54875595112162,null,0]
[263,null,247.69091693005203,null,1360.4334752985221,null,1759.1977193773444,null,3879.6113079974616,null,3173.8219080653625,null,469.54875595112162,null,{"$f":"HLOOKUP(P282,C282:$M$520,A782,0)","v":"A"},247.69091693005203,9.5369944254005414,null,0,null,1112.7425583684701,null,1511.5068024472923,null,3631.9203910674096,null,2926.1309911353105,null,221.85783902106959,null,0]
[264,null,2698.1210833432756,null,1112.7425583684701,null,1511.5068024472923,null,3631.9203910674096,null,2926.1309911353105,null,221.85783902106959,null,{"$f":"HLOOKUP(P283,C283:$M$520,A783,0)","v":"F"},221.85783902106959,9.4123635220811561,null,2476.263244322206,null,890.88471934740051,null,1289.6489634262227,null,3410.06255204634,null,2704.2731521142409,null,0,null,0]
[265,null,2476.263244322206,null,890.88471934740051,null,1289.6489634262227,null,3410.06255204634,null,2704.2731521142409,null,2536.2878722100481,null,{"$f":"HLOOKUP(P284,C284:$M$520,A784,0)","v":"B"},890.88471934740051,9.5459687116823169,null,1585.3785249748055,null,0,null,398.76424407882223,null,2519.1778326989397,null,1813.3884327668404,null,1645.4031528626476,null,0]
[266,null,1585.3785249748055,null,2047.4216200977612,null,398.76424407882223,null,2519.1778326989397,null,1813.3884327668404,null,1645.4031528626476,null,{"$f":"HLOOKUP(P285,C285:$M$520,A785,0)","v":"C"},398.76424407882223,11.0076463424961,null,1186.6142808959833,null,1648.657376018939,null,0,null,2120.4135886201175,null,1414.6241886880182,null,1246.6389087838254,null,0]
[267,null,1186.6142808959833,null,1648.657376018939,null,6856.2418366026823,null,2120.4135886201175,null,1414.6241886880182,null,1246.6389087838254,null,{"$f":"HLOOKUP(P286,C286:$M$520,A786,0)","v":"A"},1186.6142808959833,9.0994848675846391,null,0,null,462.04309512295572,null,5669.6275557066992,null,933.79930772413422,null,228.00990779203494,null,60.024627887842144,null,0]
[268,null,2910.2156393996761,null,462.04309512295572,null,5669.6275557066992,null,933.79930772413422,null,228.00990779203494,null,60.024627887842144,null,{"$f":"HLOOKUP(P287,C287:$M$520,A787,0)","v":"F"},60.024627887842144,10.629406962281557,null,2850.1910115118339,null,402.01846723511358,null,5609.6029278188571,null,873.77467983629208,null,167.98527990419279,null,0,null,1]
[269,null,2850.1910115118339,null,402.01846723511358,null,5609.6029278188571,null,873.77467983629208,null,167.98527990419279,null,1179.3806094770453,null,{"$f":"HLOOKUP(P288,C288:$M$520,A788,0)","v":"E"},167.98527990419279,9.3655888665225575,null,2682.2057316076412,null,234.03318733092078,null,5441.6176479146643,null,705.78939993209929,null,0,null,1011.3953295728525,null,0]
[270,null,2682.2057316076412,null,234.03318733092078,null,5441.6176479146643,null,705.78939993209929,null,4556.8282262940002,null,1011.3953295728525,null,{"$f":"HLOOKUP(P289,C289:$M$520,A789,0)","v":"B"},234.03318733092078,10.490054365346754,null,2448.1725442767201,null,0,null,5207.5844605837437,null,471.7562126011785,null,4322.7950389630796,null,777.36214224193168,null,0]
[271,null,2448.1725442767201,null,1209.608972783285,null,5207.5844605837437,null,471.7562126011785,null,4322.7950389630796,null,777.36214224193168,null,{"$f":"HLOOKUP(P290,C290:$M$520,A790,0)","v":"D"},471.7562126011785,9.6853464969057192,null,1976.4163316755416,null,737.85276018210652,null,4735.8282479825648,null,0,null,3851.0388263619011,null,305.60592964075317,null,0]
[272,null,1976.4163316755416,null,737.85276018210652,null,4735.8282479825648,null,6214.5015269711248,null,3851.0388263619011,null,305.60592964075317,null,{"$f":"HLOOKUP(P291,C291:$M$520,A791,0)","v":"F"},305.60592964075317,9.8973503243007706,null,1670.8104020347885,null,432.24683054135335,null,4430.2223183418118,null,5908.8955973303719,null,3545.4328967211477,null,0,null,0]
[273,null,1670.8104020347885,null,432.24683054135335,null,4430.2223183418118,null,5908.8955973303719,null,3545.4328967211477,null,1908.8633225624621,null,{"$f":"HLOOKUP(P292,C292:$M$520,A792,0)","v":"B"},432.24683054135335,9.2801093474442311,null,1238.5635714934351,null,0,null,3997.9754878004587,null,5476.6487667890187,null,3113.1860661797946,null,1476.6164920211088,null,0]
[274,null,1238.5635714934351,null,1798.7613068124724,null,3997.9754878004587,null,5476.6487667890187,null,3113.1860661797946,null,1476.6164920211088,null,{"$f":"HLOOKUP(P293,C293:$M$520,A793,0)","v":"A"},1238.5635714934351,8.2664893114215623,null,0,null,560.19773531903729,null,2759.4119163070236,null,4238.0851952955836,null,1874.6224946863595,null,238.05292052767368,null,0]
[275,null,3827.9494030929341,null,560.19773531903729,null,2759.4119163070236,null,4238.0851952955836,null,1874.6224946863595,null,238.05292052767368,null,{"$f":"HLOOKUP(P294,C294:$M$520,A794,0)","v":"F"},238.05292052767368,9.4354269809397895,null,3589.8964825652602,null,322.14481479136361,null,2521.3589957793502,null,4000.0322747679102,null,1636.5695741586858,null,0,null,0]
[276,null,3589.8964825652602,null,322.14481479136361,null,2521.3589957793502,null,4000.0322747679102,null,1636.5695741586858,null,2382.2510556333214,null,{"$f":"HLOOKUP(P295,C295:$M$520,A795,0)","v":"B"},322.14481479136361,9.6220354498485818,null,3267.7516677738968,null,0,null,2199.2141809879868,null,3677.8874599765468,null,1314.4247593673222,null,2060.1062408419575,null,0]
[277,null,3267.7516677738968,null,2397.4164907953864,null,2199.2141809879868,null,3677.8874599765468,null,1314.4247593673222,null,2060.1062408419575,null,{"$f":"HLOOKUP(P296,C296:$M$520,A796,0)","v":"E"},1314.4247593673222,9.2617591835503816,null,1953.3269084065746,null,1082.9917314280642,null,884.7894216206646,null,2363.4627006092246,null,0,null,745.68148147463535,null,0]
[278,null,1953.3269084065746,null,1082.9917314280642,null,884.7894216206646,null,2363.4627006092246,null,4335.2610612371454,null,745.68148147463535,null,{"$f":"HLOOKUP(P297,C297:$M$520,A797,0)","v":"F"},745.68148147463535,10.333398648263856,null,1207.6454269319393,null,337.31024995342887,null,139.10794014602925,null,1617.7812191345893,null,3589.5795797625101,null,0,null,0]
[279,null,1207.6454269319393,null,337.31024995342887,null,139.10794014602925,null,1617.7812191345893,null,3589.5795797625101,null,2026.737518136046,null,{"$f":"HLOOKUP(P298,C298:$M$520,A798,0)","v":"C"},139.10794014602925,10.42136716133917,null,1068.53748678591,null,198.20230980739962,null,0,null,1478.67327898856,null,3450.4716396164808,null,1887.6295779900167,null,0]
[280,null,1068.53748678591,null,198.20230980739962,null,2140.3821889095962,null,1478.67327898856,null,3450.4716396164808,null,1887.6295779900167,null,{"$f":"HLOOKUP(P299,C299:$M$520,A799,0)","v":"B"},198.20230980739962,9.9510125301116741,null,870.33517697851039,null,0,null,1942.1798791021965,null,1280.4709691811604,null,3252.2693298090812,null,1689.4272681826171,null,0]
[281,null,870.33517697851039,null,1909.8424805144018,null,1942.1798791021965,null,1280.4709691811604,null,3252.2693298090812,null,1689.4272681826171,null,{"$f":"HLOOKUP(P300,C300:$M$520,A800,0)","v":"A"},870.33517697851039,10.070590191629902,null,0,null,1039.5073035358914,null,1071.8447021236861,null,410.13579220265001,null,2381.9341528305708,null,819.09209120410674,null,0]
[282,null,4327.5680027085018,null,1039.5073035358914,null,1071.8447021236861,null,410.13579220265001,null,2381.9341528305708,null,819.09209120410674,null,{"$f":"HLOOKUP(P301,C301:$M$520,A801,0)","v":"D"},410.13579220265001,12.244515960174487,null,3917.4322105058518,null,629.37151133324141,null,661.70890992103614,null,0,null,1971.7983606279208,null,408.95629900145673,null,0]
[283,null,3917.4322105058518,null,629.37151133324141,null,661.70890992103614,null,2480.251708185403,null,1971.7983606279208,null,408.95629900145673,null,{"$f":"HLOOKUP(P302,C302:$M$520,A802,0)","v":"F"},408.95629900145673,10.761711992175469,null,3508.4759115043953,null,220.41521233178469,null,252.75261091957941,null,2071.2954091839465,null,1562.8420616264641,null,0,null,0]
[284,null,3508.4759115043953,null,220.41521233178469,null,252.75261091957941,null,2071.2954091839465,null,1562.8420616264641,null,1810.2835724928902,null,{"$f":"HLOOKUP(P303,C303:$M$520,A803,0)","v":"B"},220.41521233178469,9.2447476603241583,null,3288.0606991726108,null,0,null,32.337398587794723,null,1850.8801968521618,null,1342.4268492946794,null,1589.8683601611056,null,0]
[285,null,3288.0606991726108,null,2442.8596299114461,null,32.337398587794723,null,1850.8801968521618,null,1342.4268492946794,null,1589.8683601611056,null,{"$f":"HLOOKUP(P304,C304:$M$520,A804,0)","v":"C"},32.337398587794723,9.9565503847924344,null,3255.7233005848161,null,2410.5222313236513,null,0,null,1818.5427982643671,null,1310.0894507068847,null,1557.5309615733108,null,1]
[286,null,3255.7233005848161,null,2410.5222313236513,null,5029.2759288786192,null,1818.5427982643671,null,1310.0894507068847,null,1557.5309615733108,null,{"$f":"HLOOKUP(P305,C305:$M$520,A805,0)","v":"E"},1310.0894507068847,9.1294055610626632,null,1945.6338498779314,null,1100.4327806167666,null,3719.1864781717345,null,508.4533475574824,null,0,null,247.44151086642614,null,0]
[287,null,1945.6338498779314,null,1100.4327806167666,null,3719.1864781717345,null,508.4533475574824,null,1762.3310091091525,null,247.44151086642614,null,{"$f":"HLOOKUP(P306,C306:$M$520,A806,0)","v":"F"},247.44151086642614,10.628314724013567,null,1698.1923390115053,null,852.99126975034051,null,3471.7449673053084,null,261.01183669105626,null,1514.8894982427264,null,0,null,0]
[288,null,1698.1923390115053,null,852.99126975034051,null,3471.7449673053084,null,261.01183669105626,null,1514.8894982427264,null,1885.3166850293799,null,{"$f":"HLOOKUP(P307,C307:$M$520,A807,0)","v":"D"},261.01183669105626,8.8604836721584217,null,1437.180502320449,null,591.97943305928425,null,3210.7331306142523,null,0,null,1253.8776615516701,null,1624.3048483383236,null,0]
[289,null,1437.180502320449,null,591.97943305928425,null,3210.7331306142523,null,7381.5317685696664,null,1253.8776615516701,null,1624.3048483383236,null,{"$f":"HLOOKUP(P308,C308:$M$520,A808,0)","v":"B"},591.97943305928425,10.585716703698328,null,845.20106926116478,null,0,null,2618.7536975549683,null,6789.5523355103824,null,661.8982284923859,null,1032.3254152790394,null,0]
[290,null,845.20106926116478,null,1751.6765646104204,null,2618.7536975549683,null,6789.5523355103824,null,661.8982284923859,null,1032.3254152790394,null,{"$f":"HLOOKUP(P309,C309:$M$520,A809,0)","v":"E"},661.8982284923859,10.395626683897088,null,183.30284076877888,null,1089.7783361180345,null,1956.8554690625824,null,6127.6541070179965,null,0,null,370.42718678665346,null,0]
[291,null,183.30284076877888,null,1089.7783361180345,null,1956.8554690625824,null,6127.6541070179965,null,6015.6562608376935,null,370.42718678665346,null,{"$f":"HLOOKUP(P310,C310:$M$520,A810,0)","v":"A"},183.30284076877888,9.7432043313037955,null,0,null,906.47549534925565,null,1773.5526282938035,null,5944.3512662492176,null,5832.3534200689146,null,187.12434601787459,null,0]
[292,null,4435.2366231140695,null,906.47549534925565,null,1773.5526282938035,null,5944.3512662492176,null,5832.3534200689146,null,187.12434601787459,null,{"$f":"HLOOKUP(P311,C311:$M$520,A811,0)","v":"F"},187.12434601787459,11.601535825669524,null,4248.1122770961947,null,719.35114933138107,null,1586.428282275929,null,5757.2269202313428,null,5645.2290740510398,null,0,null,0]
[293,null,4248.1122770961947,null,719.35114933138107,null,1586.428282275929,null,5757.2269202313428,null,5645.2290740510398,null,2721.6847872128028,null,{"$f":"HLOOKUP(P312,C312:$M$520,A812,0)","v":"B"},719.35114933138107,11.076929274569366,null,3528.7611277648139,null,0,null,867.07713294454788,null,5037.8757708999619,null,4925.8779247196589,null,2002.3336378814217,null,0]
[294,null,3528.7611277648139,null,1925.7917608588423,null,867.07713294454788,null,5037.8757708999619,null,4925.8779247196589,null,2002.3336378814217,null,{"$f":"HLOOKUP(P313,C313:$M$520,A813,0)","v":"C"},867.07713294454788,11.110397411498258,null,2661.683994820266,null,1058.7146279142944,null,0,null,4170.7986379554141,null,4058.8007917751111,null,1135.2565049368739,null,0]
[295,null,2661.683994820266,null,1058.7146279142944,null,3879.9811489728131,null,4170.7986379554141,null,4058.8007917751111,null,1135.2565049368739,null,{"$f":"HLOOKUP(P314,C314:$M$520,A814,0)","v":"B"},1058.7146279142944,10.73746178098472,null,1602.9693669059716,null,0,null,2821.2665210585187,null,3112.0840100411197,null,3000.0861638608167,null,76.541877022579456,null,0]
[296,null,1602.9693669059716,null,2487.5091696052082,null,2821.2665210585187,null,3112.0840100411197,null,3000.0861638608167,null,76.541877022579456,null,{"$f":"HLOOKUP(P315,C315:$M$520,A815,0)","v":"F"},76.541877022579456,9.4919957866955063,null,1526.4274898833921,null,2410.9672925826289,null,2744.7246440359395,null,3035.54213301854,null,2923.544286838237,null,0,null,1]
[297,null,1526.4274898833921,null,2410.9672925826289,null,2744.7246440359395,null,3035.54213301854,null,2923.544286838237,null,3228.3289489641766,null,{"$f":"HLOOKUP(P316,C316:$M$520,A816,0)","v":"A"},1526.4274898833921,9.531087767135979,null,0,null,884.53980269923682,null,1218.2971541525474,null,1509.1146431351478,null,1397.1167969548449,null,1701.9014590807844,null,0]
[298,null,3552.1690750818348,null,884.53980269923682,null,1218.2971541525474,null,1509.1146431351478,null,1397.1167969548449,null,1701.9014590807844,null,{"$f":"HLOOKUP(P317,C317:$M$520,A817,0)","v":"B"},884.53980269923682,9.5726455930369632,null,2667.6292723825982,null,0,null,333.75735145331055,null,624.57484043591103,null,512.57699425560804,null,817.36165638154762,null,0]
[299,null,2667.6292723825982,null,2450.1849276312296,null,333.75735145331055,null,624.57484043591103,null,512.57699425560804,null,817.36165638154762,null,{"$f":"HLOOKUP(P318,C318:$M$520,A818,0)","v":"C"},333.75735145331055,9.6958127999460277,null,2333.8719209292876,null,2116.427576177919,null,0,null,290.81748898260048,null,178.81964280229749,null,483.60430492823707,null,0]
[300,null,2333.8719209292876,null,2116.427576177919,null,5412.3603984981337,null,290.81748898260048,null,178.81964280229749,null,483.60430492823707,null,{"$f":"HLOOKUP(P319,C319:$M$520,A819,0)","v":"E"},178.81964280229749,9.8940343929410641,null,2155.0522781269901,null,1937.6079333756215,null,5233.5407556958362,null,111.99784618030299,null,0,null,304.78466212593958,null,0]
[301,null,2155.0522781269901,null,1937.6079333756215,null,5233.5407556958362,null,111.99784618030299,null,2459.7045353747922,null,304.78466212593958,null,{"$f":"HLOOKUP(P320,C320:$M$520,A820,0)","v":"D"},111.99784618030299,10.244131427142857,null,2043.0544319466871,null,1825.6100871953186,null,5121.5429095155332,null,0,null,2347.7066891944892,null,192.78681594563659,null,0]
[302,null,2043.0544319466871,null,1825.6100871953186,null,5121.5429095155332,null,3359.8151229998771,null,2347.7066891944892,null,192.78681594563659,null,{"$f":"HLOOKUP(P321,C321:$M$520,A821,0)","v":"F"},192.78681594563659,9.8441631791931599,null,1850.2676160010506,null,1632.823271249682,null,4928.7560935698966,null,3167.0283070542405,null,2154.9198732488526,null,0,null,0]
[303,null,1850.2676160010506,null,1632.823271249682,null,4928.7560935698966,null,3167.0283070542405,null,2154.9198732488526,null,1117.7145841664296,null,{"$f":"HLOOKUP(P322,C322:$M$520,A822,0)","v":"F"},1117.7145841664296,10.0493428161179,null,732.55303183462092,null,515.10868708325233,null,3811.041509403467,null,2049.3137228878109,null,1037.205289082423,null,0,null,0]
[304,null,732.55303183462092,null,515.10868708325233,null,3811.041509403467,null,2049.3137228878109,null,1037.205289082423,null,3373.9176504734214,null,{"$f":"HLOOKUP(P323,C323:$M$520,A823,0)","v":"B"},515.10868708325233,9.3866947307503334,null,217.44434475136859,null,0,null,3295.9328223202147,null,1534.2050358045585,null,522.09660199917062,null,2858.8089633901691,null,0]
[305,null,217.44434475136859,null,1812.7734258815201,null,3295.9328223202147,null,1534.2050358045585,null,522.09660199917062,null,2858.8089633901691,null,{"$f":"HLOOKUP(P324,C324:$M$520,A824,0)","v":"A"},217.44434475136859,10.096532207503039,null,0,null,1595.3290811301515,null,3078.4884775688461,null,1316.7606910531899,null,304.65225724780203,null,2641.3646186388005,null,0]
[306,null,3820.4754364688256,null,1595.3290811301515,null,3078.4884775688461,null,1316.7606910531899,null,304.65225724780203,null,2641.3646186388005,null,{"$f":"HLOOKUP(P325,C325:$M$520,A825,0)","v":"E"},304.65225724780203,10.197723337408343,null,3515.8231792210236,null,1290.6768238823495,null,2773.836220321044,null,1012.1084338053879,null,0,null,2336.7123613909985,null,0]
[307,null,3515.8231792210236,null,1290.6768238823495,null,2773.836220321044,null,1012.1084338053879,null,5853.3608893971605,null,2336.7123613909985,null,{"$f":"HLOOKUP(P326,C326:$M$520,A826,0)","v":"D"},1012.1084338053879,9.7346770860709988,null,2503.7147454156357,null,278.56839007696158,null,1761.7277865156561,null,0,null,4841.2524555917726,null,1324.6039275856106,null,0]
[308,null,2503.7147454156357,null,278.56839007696158,null,1761.7277865156561,null,1881.5055973243423,null,4841.2524555917726,null,1324.6039275856106,null,{"$f":"HLOOKUP(P327,C327:$M$520,A827,0)","v":"B"},278.56839007696158,10.245489784529315,null,2225.1463553386739,null,0,null,1483.1593964386946,null,1602.9372072473807,null,4562.6840655148108,null,1046.035537508649,null,0]
[309,null,2225.1463553386739,null,1845.1676211591744,null,1483.1593964386946,null,1602.9372072473807,null,4562.6840655148108,null,1046.035537508649,null,{"$f":"HLOOKUP(P328,C328:$M$520,A828,0)","v":"F"},1046.035537508649,9.9799161179515465,null,1179.1108178300249,null,799.13208365052537,null,437.12385893004557,null,556.9016697387317,null,3516.6485280061615,null,0,null,0]
[310,null,1179.1108178300249,null,799.13208365052537,null,437.12385893004557,null,556.9016697387317,null,3516.6485280061615,null,1709.6981307897365,null,{"$f":"HLOOKUP(P329,C329:$M$520,A829,0)","v":"C"},437.12385893004557,10.156221479342909,null,741.9869588999793,null,362.0082247204798,null,0,null,119.77781080868613,null,3079.524669076116,null,1272.574271859691,null,0]
[311,null,741.9869588999793,null,362.0082247204798,null,4843.9040560136109,null,119.77781080868613,null,3079.524669076116,null,1272.574271859691,null,{"$f":"HLOOKUP(P330,C330:$M$520,A830,0)","v":"D"},119.77781080868613,9.8034491892865301,null,622.20914809129317,null,242.23041391179368,null,4724.126245204925,null,0,null,2959.7468582674301,null,1152.7964610510048,null,0]
[312,null,622.20914809129317,null,242.23041391179368,null,4724.126245204925,null,5551.4967406602373,null,2959.7468582674301,null,1152.7964610510048,null,{"$f":"HLOOKUP(P331,C331:$M$520,A831,0)","v":"B"},242.23041391179368,10.13899143454468,null,379.9787341794995,null,0,null,4481.8958312931318,null,5309.266326748444,null,2717.5164443556364,null,910.56604713921115,null,0]
[313,null,379.9787341794995,null,2391.3846395512205,null,4481.8958312931318,null,5309.266326748444,null,2717.5164443556364,null,910.56604713921115,null,{"$f":"HLOOKUP(P332,C332:$M$520,A832,0)","v":"A"},379.9787341794995,9.8670726698039957,null,0,null,2011.405905371721,null,4101.9170971136318,null,4929.2875925689441,null,2337.5377101761369,null,530.58731295971165,null,0]
[314,null,3911.7520557118823,null,2011.405905371721,null,4101.9170971136318,null,4929.2875925689441,null,2337.5377101761369,null,530.58731295971165,null,{"$f":"HLOOKUP(P333,C333:$M$520,A833,0)","v":"F"},530.58731295971165,8.8701270724025214,null,3381.1647427521707,null,1480.8185924120094,null,3571.3297841539202,null,4398.7002796092329,null,1806.9503972164252,null,0,null,0]
[315,null,3381.1647427521707,null,1480.8185924120094,null,3571.3297841539202,null,4398.7002796092329,null,1806.9503972164252,null,1956.2909992040941,null,{"$f":"HLOOKUP(P334,C334:$M$520,A834,0)","v":"B"},1480.8185924120094,10.26390741352998,null,1900.3461503401613,null,0,null,2090.5111917419108,null,2917.8816871972235,null,326.13180480441588,null,475.47240679208471,null,0]
[316,null,1900.3461503401613,null,1532.085072254481,null,2090.5111917419108,null,2917.8816871972235,null,326.13180480441588,null,475.47240679208471,null,{"$f":"HLOOKUP(P335,C335:$M$520,A835,0)","v":"E"},326.13180480441588,10.618926809085323,null,1574.2143455357455,null,1205.9532674500651,null,1764.3793869374949,null,2591.7498823928076,null,0,null,149.34060198766883,null,0]
[317,null,1574.2143455357455,null,1205.9532674500651,null,1764.3793869374949,null,2591.7498823928076,null,5915.2847781256396,null,149.34060198766883,null,{"$f":"HLOOKUP(P336,C336:$M$520,A836,0)","v":"F"},149.34060198766883,10.385663363417221,null,1424.8737435480766,null,1056.6126654623963,null,1615.0387849498261,null,2442.4092804051388,null,5765.9441761379712,null,0,null,0]
[318,null,1424.8737435480766,null,1056.6126654623963,null,1615.0387849498261,null,2442.4092804051388,null,5765.9441761379712,null,2195.2772877303892,null,{"$f":"HLOOKUP(P337,C337:$M$520,A837,0)","v":"B"},1056.6126654623963,10.06945635655685,null,368.26107808568031,null,0,null,558.42611948742979,null,1385.7966149427425,null,4709.3315106755745,null,1138.6646222679929,null,0]
[319,null,368.26107808568031,null,2096.8636190673242,null,558.42611948742979,null,1385.7966149427425,null,4709.3315106755745,null,1138.6646222679929,null,{"$f":"HLOOKUP(P338,C338:$M$520,A838,0)","v":"A"},368.26107808568031,10.51829997932945,null,0,null,1728.6025409816439,null,190.16504140174948,null,1017.5355368570622,null,4341.0704325898942,null,770.40354418231254,null,0]
[320,null,4591.1472388018319,null,1728.6025409816439,null,190.16504140174948,null,1017.5355368570622,null,4341.0704325898942,null,770.40354418231254,null,{"$f":"HLOOKUP(P339,C339:$M$520,A839,0)","v":"C"},190.16504140174948,9.3917998682144717,null,4400.9821974000824,null,1538.4374995798944,null,0,null,827.37049545531272,null,4150.9053911881447,null,580.23850278056307,null,0]
[321,null,4400.9821974000824,null,1538.4374995798944,null,5833.7238720249752,null,827.37049545531272,null,4150.9053911881447,null,580.23850278056307,null,{"$f":"HLOOKUP(P340,C340:$M$520,A840,0)","v":"F"},{"$f":"MIN(C340:M340)","v":580.23850278056307},{"$f":"IF(O340=C$19,EXP(NORMINV(RAND(),C$8,C$9)),IF(O340=E$19,EXP(NORMINV(RAND(),E$8,E$9)),IF(O340=G$19,EXP(NORMINV(RAND(),G$8,G$9)),IF(O340=I$19,EXP(NORMINV(RAND(),I$8,I$9)),IF(O340=K$19,EXP(NORMINV(RAND(),K$8,K$9)),IF(O340=M$19,EXP(NORMINV(RAND(),M$8,M$9))))))))","v":11.022834317655958},null,{"$f":"IF(OR(C$3=\"\",C$4=\"\"),\"\",IF($O340=S$19,0,C340-$P340))","v":3820.7436946195194},null,{"$f":"IF(OR(E$3=\"\",E$4=\"\"),\"\",IF($O340=U$19,0,E340-$P340))","v":958.19899679933133},null,{"$f":"IF(OR(G$3=\"\",G$4=\"\"),\"\",IF($O340=W$19,0,G340-$P340))","v":5253.4853692444121},null,{"$f":"IF(OR(I$3=\"\",I$4=\"\"),\"\",IF($O340=Y$19,0,I340-$P340))","v":247.13199267474965},null,{"$f":"IF(OR(K$3=\"\",K$4=\"\"),\"\",IF($O340=AA$19,0,K340-$P340))","v":3570.6668884075816},null,{"$f":"IF(OR(M$3=\"\",M$4=\"\"),\"\",IF($O340=AC$19,0,M340-$P340))","v":0},null,{"$f":"IF(P340>=$P$3,0,1)","v":0}]
[322,null,3820.7436946195194,null,958.19899679933133,null,5253.4853692444121,null,247.13199267474965,null,3570.6668884075816,null,2156.3035685601699,null,{"$f":"HLOOKUP(P341,C341:$M$520,A841,0)","v":"D"},247.13199267474965,10.826778443955455,null,3573.6117019447697,null,711.06700412458167,null,5006.3533765696629,null,0,null,3323.534895732832,null,1909.1715758854202,null,0]
[323,null,{"$f":"IF(OR(C$3=\"\",C$4=\"\"),\"\",IF(S341=0,C$2+C$4*(LN(1/(1-RAND())))^(1/C$3),S341))","v":3573.6117019447697},null,{"$f":"IF(OR(E$3=\"\",E$4=\"\"),\"\",IF(U341=0,E$2+E$4*(LN(1/(1-RAND())))^(1/E$3),U341))","v":711.06700412458167},null,{"$f":"IF(OR(G$3=\"\",G$4=\"\"),\"\",IF(W341=0,G$2+G$4*(LN(1/(1-RAND())))^(1/G$3),W341))","v":5006.3533765696629},null,{"$f":"IF(OR(I$3=\"\",I$4=\"\"),\"\",IF(Y341=0,I$2+I$4*(LN(1/(1-RAND())))^(1/I$3),Y341))","v":6134.9201072098413},null,{"$f":"IF(OR(K$3=\"\",K$4=\"\"),\"\",IF(AA341=0,K$2+K$4*(LN(1/(1-RAND())))^(1/K$3),AA341))","v":3323.534895732832},null,{"$f":"IF(OR(M$3=\"\",M$4=\"\"),\"\",IF(AC341=0,M$2+M$4*(LN(1/(1-RAND())))^(1/M$3),AC341))","v":1909.1715758854202},null,{"$f":"HLOOKUP(P342,C342:$M$520,A842,0)","v":"B"},711.06700412458167,10.813968418857607,null,2862.544697820188,null,0,null,4295.2863724450817,null,5423.8531030852591,null,2612.4678916082503,null,1198.1045717608386,null,0]
[324,null,2862.544697820188,null,1916.1530373710953,null,4295.2863724450817,null,5423.8531030852591,null,2612.4678916082503,null,1198.1045717608386,null,{"$f":"HLOOKUP(P343,C343:$M$520,A843,0)","v":"F"},1198.1045717608386,9.7099089904657259,null,1664.4401260593495,null,718.0484656102567,null,3097.1818006842432,null,4225.7485313244206,null,1414.3633198474117,null,0,null,0]
[325,null,1664.4401260593495,null,718.0484656102567,null,3097.1818006842432,null,4225.7485313244206,null,1414.3633198474117,null,1332.3292997655524,null,{"$f":"HLOOKUP(P344,C344:$M$520,A844,0)","v":"B"},718.0484656102567,10.564482331763189,null,946.3916604490928,null,0,null,2379.1333350739865,null,3507.7000657141639,null,696.31485423715503,null,614.28083415529568,null,0]
[326,null,946.3916604490928,null,2296.2130410772011,null,2379.1333350739865,null,3507.7000657141639,null,696.31485423715503,null,614.28083415529568,null,{"$f":"HLOOKUP(P345,C345:$M$520,A845,0)","v":"F"},614.28083415529568,10.040404349838212,null,332.11082629379712,null,1681.9322069219054,null,1764.8525009186908,null,2893.419231558868,null,82.034020081859353,null,0,null,0]
[327,null,332.11082629379712,null,1681.9322069219054,null,1764.8525009186908,null,2893.419231558868,null,82.034020081859353,null,2449.0962366581284,null,{"$f":"HLOOKUP(P346,C346:$M$520,A846,0)","v":"E"},82.034020081859353,9.7158820256006582,null,250.07680621193776,null,1599.898186840046,null,1682.8184808368314,null,2811.3852114770089,null,0,null,2367.0622165762688,null,1]
[328,null,250.07680621193776,null,1599.898186840046,null,1682.8184808368314,null,2811.3852114770089,null,5504.7439618816434,null,2367.0622165762688,null,{"$f":"HLOOKUP(P347,C347:$M$520,A847,0)","v":"A"},250.07680621193776,9.5589333502392808,null,0,null,1349.8213806281083,null,1432.7416746248937,null,2561.3084052650711,null,5254.6671556697056,null,2116.9854103643311,null,0]
[329,null,4068.3097653456712,null,1349.8213806281083,null,1432.7416746248937,null,2561.3084052650711,null,5254.6671556697056,null,2116.9854103643311,null,{"$f":"HLOOKUP(P348,C348:$M$520,A848,0)","v":"B"},1349.8213806281083,9.9715362093180584,null,2718.4883847175629,null,0,null,82.920293996785404,null,1211.4870246369628,null,3904.8457750415973,null,767.1640297362228,null,0]
[330,null,2718.4883847175629,null,1686.1325428640107,null,82.920293996785404,null,1211.4870246369628,null,3904.8457750415973,null,767.1640297362228,null,{"$f":"HLOOKUP(P349,C349:$M$520,A849,0)","v":"C"},82.920293996785404,9.7417611030616396,null,2635.5680907207775,null,1603.2122488672253,null,0,null,1128.5667306401774,null,3821.9254810448119,null,684.2437357394374,null,1]
[331,null,2635.5680907207775,null,1603.2122488672253,null,3107.1978069468655,null,1128.5667306401774,null,3821.9254810448119,null,684.2437357394374,null,{"$f":"HLOOKUP(P350,C350:$M$520,A850,0)","v":"F"},684.2437357394374,9.9553131873416749,null,1951.3243549813401,null,918.9685131277879,null,2422.9540712074281,null,444.32299490074001,null,3137.6817453053745,null,0,null,0]
[332,null,1951.3243549813401,null,918.9685131277879,null,2422.9540712074281,null,444.32299490074001,null,3137.6817453053745,null,2292.4706710051905,null,{"$f":"HLOOKUP(P351,C351:$M$520,A851,0)","v":"D"},444.32299490074001,10.032364461027816,null,1507.0013600806001,null,474.64551822704789,null,1978.6310763066881,null,0,null,2693.3587504046345,null,1848.1476761044505,null,0]
[333,null,1507.0013600806001,null,474.64551822704789,null,1978.6310763066881,null,5019.4922219174923,null,2693.3587504046345,null,1848.1476761044505,null,{"$f":"HLOOKUP(P352,C352:$M$520,A852,0)","v":"B"},474.64551822704789,8.5936566581947371,null,1032.3558418535522,null,0,null,1503.9855580796402,null,4544.846703690444,null,2218.7132321775866,null,1373.5021578774026,null,0]
[334,null,1032.3558418535522,null,2422.8935738584496,null,1503.9855580796402,null,4544.846703690444,null,2218.7132321775866,null,1373.5021578774026,null,{"$f":"HLOOKUP(P353,C353:$M$520,A853,0)","v":"A"},1032.3558418535522,10.361029448731964,null,0,null,1390.5377320048974,null,471.62971622608802,null,3512.4908618368918,null,1186.3573903240344,null,341.14631602385043,null,0]
[335,null,4052.5982826747513,null,1390.5377320048974,null,471.62971622608802,null,3512.4908618368918,null,1186.3573903240344,null,341.14631602385043,null,{"$f":"HLOOKUP(P354,C354:$M$520,A854,0)","v":"F"},341.14631602385043,11.32089239976227,null,3711.4519666509009,null,1049.391415981047,null,130.48340020223759,null,3171.3445458130413,null,845.21107430018401,null,0,null,0]
[336,null,3711.4519666509009,null,1049.391415981047,null,130.48340020223759,null,3171.3445458130413,null,845.21107430018401,null,2090.6927232854014,null,{"$f":"HLOOKUP(P355,C355:$M$520,A855,0)","v":"C"},130.48340020223759,10.917617277867935,null,3580.9685664486633,null,918.90801577880939,null,0,null,3040.8611456108038,null,714.72767409794642,null,1960.2093230831638,null,0]
[337,null,3580.9685664486633,null,918.90801577880939,null,5432.9264304014123,null,3040.8611456108038,null,714.72767409794642,null,1960.2093230831638,null,{"$f":"HLOOKUP(P356,C356:$M$520,A856,0)","v":"E"},714.72767409794642,10.887305859648469,null,2866.2408923507169,null,204.18034168086297,null,4718.1987563034654,null,2326.1334715128573,null,0,null,1245.4816489852174,null,0]
[338,null,2866.2408923507169,null,204.18034168086297,null,4718.1987563034654,null,2326.1334715128573,null,1644.1330825692548,null,1245.4816489852174,null,{"$f":"HLOOKUP(P357,C357:$M$520,A857,0)","v":"B"},204.18034168086297,11.2133785474634,null,2662.0605506698539,null,0,null,4514.018414622602,null,2121.9531298319944,null,1439.9527408883919,null,1041.3013073043544,null,0]
[339,null,2662.0605506698539,null,1979.4544245446648,null,4514.018414622602,null,2121.9531298319944,null,1439.9527408883919,null,1041.3013073043544,null,{"$f":"HLOOKUP(P358,C358:$M$520,A858,0)","v":"F"},1041.3013073043544,9.891064841647438,null,1620.7592433654995,null,938.15311724031039,null,3472.7171073182476,null,1080.65182252764,null,398.65143358403748,null,0,null,0]
[340,null,1620.7592433654995,null,938.15311724031039,null,3472.7171073182476,null,1080.65182252764,null,398.65143358403748,null,2291.6437046086603,null,{"$f":"HLOOKUP(P359,C359:$M$520,A859,0)","v":"E"},398.65143358403748,8.4953904914283136,null,1222.107809781462,null,539.50168365627292,null,3074.0656737342101,null,682.0003889436025,null,0,null,1892.9922710246228,null,0]
[341,null,1222.107809781462,null,539.50168365627292,null,3074.0656737342101,null,682.0003889436025,null,4413.2439313246759,null,1892.9922710246228,null,{"$f":"HLOOKUP(P360,C360:$M$520,A860,0)","v":"B"},539.50168365627292,9.942729071047296,null,682.60612612518912,null,0,null,2534.563990077937,null,142.49870528732959,null,3873.7422476684033,null,1353.4905873683499,null,0]
[342,null,682.60612612518912,null,2205.8077444612518,null,2534.563990077937,null,142.49870528732959,null,3873.7422476684033,null,1353.4905873683499,null,{"$f":"HLOOKUP(P361,C361:$M$520,A861,0)","v":"D"},142.49870528732959,10.204088857592579,null,540.10742083785954,null,2063.3090391739224,null,2392.0652847906076,null,0,null,3731.2435423810739,null,1210.9918820810203,null,0]
[343,null,540.10742083785954,null,2063.3090391739224,null,2392.0652847906076,null,3782.4371978732952,null,3731.2435423810739,null,1210.9918820810203,null,{"$f":"HLOOKUP(P362,C362:$M$520,A862,0)","v":"A"},540.10742083785954,10.46100860595795,null,0,null,1523.2016183360629,null,1851.9578639527481,null,3242.3297770354357,null,3191.1361215432144,null,670.88446124316079,null,0]
[344,null,4176.3059109885435,null,1523.2016183360629,null,1851.9578639527481,null,3242.3297770354357,null,3191.1361215432144,null,670.88446124316079,null,{"$f":"HLOOKUP(P363,C363:$M$520,A863,0)","v":"F"},670.88446124316079,10.043564077127392,null,3505.4214497453827,null,852.31715709290211,null,1181.0734027095873,null,2571.4453157922749,null,2520.2516603000536,null,0,null,0]
[345,null,3505.4214497453827,null,852.31715709290211,null,1181.0734027095873,null,2571.4453157922749,null,2520.2516603000536,null,3092.2304090380435,null,{"$f":"HLOOKUP(P364,C364:$M$520,A864,0)","v":"B"},852.31715709290211,9.8331268660139663,null,2653.1042926524806,null,0,null,328.75624561668519,null,1719.1281586993728,null,1667.9345032071515,null,2239.9132519451414,null,0]
[346,null,2653.1042926524806,null,1665.8495758852309,null,328.75624561668519,null,1719.1281586993728,null,1667.9345032071515,null,2239.9132519451414,null,{"$f":"HLOOKUP(P365,C365:$M$520,A865,0)","v":"C"},328.75624561668519,9.1172804994869487,null,2324.3480470357954,null,1337.0933302685457,null,0,null,1390.3719130826876,null,1339.1782575904663,null,1911.1570063284562,null,0]
[347,null,2324.3480470357954,null,1337.0933302685457,null,2110.6687414108892,null,1390.3719130826876,null,1339.1782575904663,null,1911.1570063284562,null,{"$f":"HLOOKUP(P366,C366:$M$520,A866,0)","v":"B"},1337.0933302685457,11.1564226740209,null,987.25471676724965,null,0,null,773.57541114234346,null,53.278582814141828,null,2.0849273219205315,null,574.06367605991045,null,0]
[348,null,987.25471676724965,null,2139.3252210913606,null,773.57541114234346,null,53.278582814141828,null,2.0849273219205315,null,574.06367605991045,null,{"$f":"HLOOKUP(P367,C367:$M$520,A867,0)","v":"E"},2.0849273219205315,9.7225618061651211,null,985.16978944532912,null,2137.2402937694401,null,771.49048382042292,null,51.193655492221296,null,0,null,571.97874873798992,null,1]
[349,null,985.16978944532912,null,2137.2402937694401,null,771.49048382042292,null,51.193655492221296,null,3105.7353118350279,null,571.97874873798992,null,{"$f":"HLOOKUP(P368,C368:$M$520,A868,0)","v":"D"},51.193655492221296,10.350264034439961,null,933.97613395310782,null,2086.0466382772188,null,720.29682832820163,null,0,null,3054.5416563428066,null,520.78509324576862,null,1]
[350,null,933.97613395310782,null,2086.0466382772188,null,720.29682832820163,null,5063.9704501434844,null,3054.5416563428066,null,520.78509324576862,null,{"$f":"HLOOKUP(P369,C369:$M$520,A869,0)","v":"F"},520.78509324576862,9.0591584406176402,null,413.1910407073392,null,1565.2615450314502,null,199.51173508243301,null,4543.1853568977158,null,2533.756563097038,null,0,null,0]
[351,null,413.1910407073392,null,1565.2615450314502,null,199.51173508243301,null,4543.1853568977158,null,2533.756563097038,null,2396.6976572247968,null,{"$f":"HLOOKUP(P370,C370:$M$520,A870,0)","v":"C"},199.51173508243301,8.6553111617801157,null,213.67930562490619,null,1365.7498099490172,null,0,null,4343.6736218152828,null,2334.244828014605,null,2197.1859221423638,null,0]
[352,null,213.67930562490619,null,1365.7498099490172,null,3891.6638417663457,null,4343.6736218152828,null,2334.244828014605,null,2197.1859221423638,null,{"$f":"HLOOKUP(P371,C371:$M$520,A871,0)","v":"A"},213.67930562490619,10.340657778341882,null,0,null,1152.070504324111,null,3677.9845361414395,null,4129.9943161903766,null,2120.5655223896988,null,1983.5066165174576,null,0]
[353,null,4521.080670322478,null,1152.070504324111,null,3677.9845361414395,null,4129.9943161903766,null,2120.5655223896988,null,1983.5066165174576,null,{"$f":"HLOOKUP(P372,C372:$M$520,A872,0)","v":"B"},1152.070504324111,10.047296568692097,null,3369.010165998367,null,0,null,2525.9140318173286,null,2977.9238118662656,null,968.49501806558783,null,831.43611219334662,null,0]
[354,null,3369.010165998367,null,2212.9721039851347,null,2525.9140318173286,null,2977.9238118662656,null,968.49501806558783,null,831.43611219334662,null,{"$f":"HLOOKUP(P373,C373:$M$520,A873,0)","v":"F"},831.43611219334662,9.3833639906389461,null,2537.5740538050204,null,1381.5359917917881,null,1694.477919623982,null,2146.487699672919,null,137.05890587224121,null,0,null,0]
[355,null,2537.5740538050204,null,1381.5359917917881,null,1694.477919623982,null,2146.487699672919,null,137.05890587224121,null,2554.3840364668595,null,{"$f":"HLOOKUP(P374,C374:$M$520,A874,0)","v":"E"},137.05890587224121,10.719974212269415,null,2400.5151479327792,null,1244.4770859195469,null,1557.4190137517407,null,2009.4287938006778,null,0,null,2417.3251305946183,null,0]
[356,null,2400.5151479327792,null,1244.4770859195469,null,1557.4190137517407,null,2009.4287938006778,null,4454.3571058741254,null,2417.3251305946183,null,{"$f":"HLOOKUP(P375,C375:$M$520,A875,0)","v":"B"},1244.4770859195469,10.250894979249271,null,1156.0380620132323,null,0,null,312.94192783219387,null,764.95170788113091,null,3209.8800199545785,null,1172.8480446750714,null,0]
[357,null,1156.0380620132323,null,1939.5229915474322,null,312.94192783219387,null,764.95170788113091,null,3209.8800199545785,null,1172.8480446750714,null,{"$f":"HLOOKUP(P376,C376:$M$520,A876,0)","v":"C"},312.94192783219387,11.085118717213925,null,843.09613418103845,null,1626.5810637152383,null,0,null,452.00978004893705,null,2896.9380921223847,null,859.90611684287751,null,0]
[358,null,843.09613418103845,null,1626.5810637152383,null,4585.6988545773256,null,452.00978004893705,null,2896.9380921223847,null,859.90611684287751,null,{"$f":"HLOOKUP(P377,C377:$M$520,A877,0)","v":"D"},452.00978004893705,8.8019998379496833,null,391.08635413210141,null,1174.5712836663013,null,4133.689074528389,null,0,null,2444.9283120734476,null,407.89633679394046,null,0]
[359,null,391.08635413210141,null,1174.5712836663013,null,4133.689074528389,null,5187.6409709211066,null,2444.9283120734476,null,407.89633679394046,null,{"$f":"HLOOKUP(P378,C378:$M$520,A878,0)","v":"A"},391.08635413210141,8.5845204456238093,null,0,null,783.48492953419986,null,3742.6027203962876,null,4796.5546167890052,null,2053.8419579413462,null,16.809982661839058,null,0]
[360,null,3951.4343783756422,null,783.48492953419986,null,3742.6027203962876,null,4796.5546167890052,null,2053.8419579413462,null,16.809982661839058,null,{"$f":"HLOOKUP(P379,C379:$M$520,A879,0)","v":"F"},16.809982661839058,11.061471875764692,null,3934.6243957138031,null,766.67494687236081,null,3725.7927377344486,null,4779.7446341271661,null,2037.0319752795072,null,0,null,1]
[361,null,3934.6243957138031,null,766.67494687236081,null,3725.7927377344486,null,4779.7446341271661,null,2037.0319752795072,null,2476.0838802680692,null,{"$f":"HLOOKUP(P380,C380:$M$520,A880,0)","v":"B"},766.67494687236081,10.220564679061082,null,3167.9494488414421,null,0,null,2959.1177908620875,null,4013.0696872548051,null,1270.3570284071463,null,1709.4089333957083,null,0]
[362,null,3167.9494488414421,null,2157.7119047693518,null,2959.1177908620875,null,4013.0696872548051,null,1270.3570284071463,null,1709.4089333957083,null,{"$f":"HLOOKUP(P381,C381:$M$520,A881,0)","v":"E"},1270.3570284071463,9.2258822245878562,null,1897.5924204342957,null,887.35487636220546,null,1688.7607624549412,null,2742.7126588476585,null,0,null,439.051904988562,null,0]
[363,null,1897.5924204342957,null,887.35487636220546,null,1688.7607624549412,null,2742.7126588476585,null,4585.5579749314011,null,439.051904988562,null,{"$f":"HLOOKUP(P382,C382:$M$520,A882,0)","v":"F"},439.051904988562,8.833364238136669,null,1458.5405154457337,null,448.30297137364346,null,1249.7088574663792,null,2303.6607538590965,null,4146.5060699428395,null,0,null,0]
[364,null,1458.5405154457337,null,448.30297137364346,null,1249.7088574663792,null,2303.6607538590965,null,4146.5060699428395,null,2032.1023158699982,null,{"$f":"HLOOKUP(P383,C383:$M$520,A883,0)","v":"B"},448.30297137364346,10.15203020053816,null,1010.2375440720903,null,0,null,801.40588609273573,null,1855.3577824854531,null,3698.2030985691963,null,1583.7993444963547,null,0]
[365,null,1010.2375440720903,null,1785.7918199446569,null,801.40588609273573,null,1855.3577824854531,null,3698.2030985691963,null,1583.7993444963547,null,{"$f":"HLOOKUP(P384,C384:$M$520,A884,0)","v":"C"},801.40588609273573,9.9975116684941483,null,208.83165797935453,null,984.38593385192121,null,0,null,1053.9518963927173,null,2896.7972124764606,null,782.39345840361898,null,0]
[366,null,208.83165797935453,null,984.38593385192121,null,3417.8800228434961,null,1053.9518963927173,null,2896.7972124764606,null,782.39345840361898,null,{"$f":"HLOOKUP(P385,C385:$M$520,A885,0)","v":"A"},208.83165797935453,10.287042300393768,null,0,null,775.55427587256668,null,3209.0483648641416,null,845.12023841336281,null,2687.965554497106,null,573.56180042426445,null,0]
[367,null,4638.8516209178442,null,775.55427587256668,null,3209.0483648641416,null,845.12023841336281,null,2687.965554497106,null,573.56180042426445,null,{"$f":"HLOOKUP(P386,C386:$M$520,A886,0)","v":"F"},573.56180042426445,9.6688972340244241,null,4065.28982049358,null,201.99247544830223,null,2635.4865644398769,null,271.55843798909837,null,2114.4037540728414,null,0,null,0]
[368,null,4065.28982049358,null,201.99247544830223,null,2635.4865644398769,null,271.55843798909837,null,2114.4037540728414,null,2053.4514067816381,null,{"$f":"HLOOKUP(P387,C387:$M$520,A887,0)","v":"B"},201.99247544830223,10.343408426282419,null,3863.2973450452778,null,0,null,2433.4940889915747,null,69.565962540796136,null,1912.4112786245391,null,1851.4589313333358,null,0]
[369,null,3863.2973450452778,null,1708.4172428866427,null,2433.4940889915747,null,69.565962540796136,null,1912.4112786245391,null,1851.4589313333358,null,{"$f":"HLOOKUP(P388,C388:$M$520,A888,0)","v":"D"},69.565962540796136,10.309480997631814,null,3793.7313825044816,null,1638.8512803458466,null,2363.9281264507786,null,0,null,1842.845316083743,null,1781.8929687925397,null,1]
[370,null,3793.7313825044816,null,1638.8512803458466,null,2363.9281264507786,null,2309.4360325132857,null,1842.845316083743,null,1781.8929687925397,null,{"$f":"HLOOKUP(P389,C389:$M$520,A889,0)","v":"B"},1638.8512803458466,10.867289067226658,null,2154.8801021586351,null,0,null,725.07684610493197,null,670.58475216743909,null,203.99403573789641,null,143.04168844669312,null,0]
[371,null,2154.8801021586351,null,1314.1033480984761,null,725.07684610493197,null,670.58475216743909,null,203.99403573789641,null,143.04168844669312,null,{"$f":"HLOOKUP(P390,C390:$M$520,A890,0)","v":"F"},143.04168844669312,9.6660615832039305,null,2011.8384137119419,null,1171.061659651783,null,582.03515765823886,null,527.54306372074598,null,60.952347291203296,null,0,null,0]
[372,null,2011.8384137119419,null,1171.061659651783,null,582.03515765823886,null,527.54306372074598,null,60.952347291203296,null,3529.8723018036249,null,{"$f":"HLOOKUP(P391,C391:$M$520,A891,0)","v":"E"},60.952347291203296,9.3977370709939247,null,1950.8860664207386,null,1110.1093123605797,null,521.08281036703556,null,466.59071642954268,null,0,null,3468.9199545124216,null,1]
[373,null,1950.8860664207386,null,1110.1093123605797,null,521.08281036703556,null,466.59071642954268,null,2656.4341618340663,null,3468.9199545124216,null,{"$f":"HLOOKUP(P392,C392:$M$520,A892,0)","v":"D"},466.59071642954268,10.46468530580001,null,1484.295349991196,null,643.518595931037,null,54.492093937492882,null,0,null,2189.8434454045237,null,3002.3292380828789,null,0]
[374,null,1484.295349991196,null,643.518595931037,null,54.492093937492882,null,2128.7866420809059,null,2189.8434454045237,null,3002.3292380828789,null,{"$f":"HLOOKUP(P393,C393:$M$520,A893,0)","v":"C"},54.492093937492882,9.2139028106391248,null,1429.8032560537031,null,589.02650199354412,null,0,null,2074.2945481434131,null,2135.3513514670308,null,2947.837144145386,null,1]
[375,null,1429.8032560537031,null,589.02650199354412,null,2527.3390894268305,null,2074.2945481434131,null,2135.3513514670308,null,2947.837144145386,null,{"$f":"HLOOKUP(P394,C394:$M$520,A894,0)","v":"B"},589.02650199354412,10.520346694936926,null,840.77675406015896,null,0,null,1938.3125874332864,null,1485.268046149869,null,1546.3248494734867,null,2358.8106421518419,null,0]
[376,null,840.77675406015896,null,2013.5327536111308,null,1938.3125874332864,null,1485.268046149869,null,1546.3248494734867,null,2358.8106421518419,null,{"$f":"HLOOKUP(P395,C395:$M$520,A895,0)","v":"A"},840.77675406015896,8.4086855083698371,null,0,null,1172.7559995509719,null,1097.5358333731274,null,644.49129208970999,null,705.5480954133277,null,1518.0338880916829,null,0]
[377,null,4153.4965376609798,null,1172.7559995509719,null,1097.5358333731274,null,644.49129208970999,null,705.5480954133277,null,1518.0338880916829,null,{"$f":"HLOOKUP(P396,C396:$M$520,A896,0)","v":"D"},644.49129208970999,9.2709656344786353,null,3509.0052455712698,null,528.26470746126188,null,453.0445412834174,null,0,null,61.056803323617714,null,873.54259600197292,null,0]
[378,null,3509.0052455712698,null,528.26470746126188,null,453.0445412834174,null,4989.5617994614286,null,61.056803323617714,null,873.54259600197292,null,{"$f":"HLOOKUP(P397,C397:$M$520,A897,0)","v":"E"},61.056803323617714,11.430102115611323,null,3447.9484422476521,null,467.20790413764416,null,391.98773795979969,null,4928.5049961378108,null,0,null,812.48579267835521,null,1]
[379,null,3447.9484422476521,null,467.20790413764416,null,391.98773795979969,null,4928.5049961378108,null,3906.7394954401575,null,812.48579267835521,null,{"$f":"HLOOKUP(P398,C398:$M$520,A898,0)","v":"C"},391.98773795979969,9.6510149450290097,null,3055.9607042878524,null,75.220166177844476,null,0,null,4536.5172581780116,null,3514.7517574803578,null,420.49805471855552,null,0]
[380,null,3055.9607042878524,null,75.220166177844476,null,4908.4970379342376,null,4536.5172581780116,null,3514.7517574803578,null,420.49805471855552,null,{"$f":"HLOOKUP(P399,C399:$M$520,A899,0)","v":"B"},75.220166177844476,9.9125553235588182,null,2980.7405381100079,null,0,null,4833.2768717563931,null,4461.2970920001671,null,3439.5315913025133,null,345.27788854071105,null,1]
[381,null,2980.7405381100079,null,2475.6044576248414,null,4833.2768717563931,null,4461.2970920001671,null,3439.5315913025133,null,345.27788854071105,null,{"$f":"HLOOKUP(P400,C400:$M$520,A900,0)","v":"F"},345.27788854071105,10.496376829287961,null,2635.4626495692969,null,2130.3265690841304,null,4487.9989832156825,null,4116.0192034594565,null,3094.2537027618023,null,0,null,0]
[382,null,2635.4626495692969,null,2130.3265690841304,null,4487.9989832156825,null,4116.0192034594565,null,3094.2537027618023,null,3143.3030518826313,null,{"$f":"HLOOKUP(P401,C401:$M$520,A901,0)","v":"B"},2130.3265690841304,9.5068304710417628,null,505.13608048516653,null,0,null,2357.6724141315522,null,1985.6926343753262,null,963.92713367767192,null,1012.9764827985009,null,0]
[383,null,505.13608048516653,null,1589.551243588598,null,2357.6724141315522,null,1985.6926343753262,null,963.92713367767192,null,1012.9764827985009,null,{"$f":"HLOOKUP(P402,C402:$M$520,A902,0)","v":"A"},505.13608048516653,9.8343091937098119,null,0,null,1084.4151631034315,null,1852.5363336463856,null,1480.5565538901596,null,458.79105319250539,null,507.84040231333438,null,0]
[384,null,4235.0837246298306,null,1084.4151631034315,null,1852.5363336463856,null,1480.5565538901596,null,458.79105319250539,null,507.84040231333438,null,{"$f":"HLOOKUP(P403,C403:$M$520,A903,0)","v":"E"},458.79105319250539,9.7805373500825272,null,3776.2926714373252,null,625.62410991092611,null,1393.7452804538802,null,1021.7655006976543,null,0,null,49.049349120828992,null,0]
[385,null,3776.2926714373252,null,625.62410991092611,null,1393.7452804538802,null,1021.7655006976543,null,7034.7865945763988,null,49.049349120828992,null,{"$f":"HLOOKUP(P404,C404:$M$520,A904,0)","v":"F"},{"$f":"MIN(C404:M404)","v":49.049349120828992},{"$f":"IF(O404=C$19,EXP(NORMINV(RAND(),C$8,C$9)),IF(O404=E$19,EXP(NORMINV(RAND(),E$8,E$9)),IF(O404=G$19,EXP(NORMINV(RAND(),G$8,G$9)),IF(O404=I$19,EXP(NORMINV(RAND(),I$8,I$9)),IF(O404=K$19,EXP(NORMINV(RAND(),K$8,K$9)),IF(O404=M$19,EXP(NORMINV(RAND(),M$8,M$9))))))))","v":9.7216434313563962},null,{"$f":"IF(OR(C$3=\"\",C$4=\"\"),\"\",IF($O404=S$19,0,C404-$P404))","v":3727.2433223164962},null,{"$f":"IF(OR(E$3=\"\",E$4=\"\"),\"\",IF($O404=U$19,0,E404-$P404))","v":576.57476079009712},null,{"$f":"IF(OR(G$3=\"\",G$4=\"\"),\"\",IF($O404=W$19,0,G404-$P404))","v":1344.6959313330512},null,{"$f":"IF(OR(I$3=\"\",I$4=\"\"),\"\",IF($O404=Y$19,0,I404-$P404))","v":972.71615157682527},null,{"$f":"IF(OR(K$3=\"\",K$4=\"\"),\"\",IF($O404=AA$19,0,K404-$P404))","v":6985.7372454555698},null,{"$f":"IF(OR(M$3=\"\",M$4=\"\"),\"\",IF($O404=AC$19,0,M404-$P404))","v":0},null,{"$f":"IF(P404>=$P$3,0,1)","v":1}]
[386,null,3727.2433223164962,null,576.57476079009712,null,1344.6959313330512,null,972.71615157682527,null,6985.7372454555698,null,2866.7536424863538,null,{"$f":"HLOOKUP(P405,C405:$M$520,A905,0)","v":"B"},576.57476079009712,9.1690471487093177,null,3150.6685615263991,null,0,null,768.12117054295413,null,396.14139078672815,null,6409.1624846654722,null,2290.1788816962567,null,0]
[387,null,{"$f":"IF(OR(C$3=\"\",C$4=\"\"),\"\",IF(S405=0,C$2+C$4*(LN(1/(1-RAND())))^(1/C$3),S405))","v":3150.6685615263991},null,{"$f":"IF(OR(E$3=\"\",E$4=\"\"),\"\",IF(U405=0,E$2+E$4*(LN(1/(1-RAND())))^(1/E$3),U405))","v":1466.0355624929812},null,{"$f":"IF(OR(G$3=\"\",G$4=\"\"),\"\",IF(W405=0,G$2+G$4*(LN(1/(1-RAND())))^(1/G$3),W405))","v":768.12117054295413},null,{"$f":"IF(OR(I$3=\"\",I$4=\"\"),\"\",IF(Y405=0,I$2+I$4*(LN(1/(1-RAND())))^(1/I$3),Y405))","v":396.14139078672815},null,{"$f":"IF(OR(K$3=\"\",K$4=\"\"),\"\",IF(AA405=0,K$2+K$4*(LN(1/(1-RAND())))^(1/K$3),AA405))","v":6409.1624846654722},null,{"$f":"IF(OR(M$3=\"\",M$4=\"\"),\"\",IF(AC405=0,M$2+M$4*(LN(1/(1-RAND())))^(1/M$3),AC405))","v":2290.1788816962567},null,{"$f":"HLOOKUP(P406,C406:$M$520,A906,0)","v":"D"},396.14139078672815,11.261581639693421,null,2754.527170739671,null,1069.894171706253,null,371.97977975622598,null,0,null,6013.0210938787441,null,1894.0374909095285,null,0]
[388,null,2754.527170739671,null,1069.894171706253,null,371.97977975622598,null,5358.9608732921452,null,6013.0210938787441,null,1894.0374909095285,null,{"$f":"HLOOKUP(P407,C407:$M$520,A907,0)","v":"C"},371.97977975622598,9.9971236382492261,null,2382.547390983445,null,697.91439195002704,null,0,null,4986.9810935359192,null,5641.0413141225181,null,1522.0577111533025,null,0]
[389,null,2382.547390983445,null,697.91439195002704,null,6017.6007066444345,null,4986.9810935359192,null,5641.0413141225181,null,1522.0577111533025,null,{"$f":"HLOOKUP(P408,C408:$M$520,A908,0)","v":"B"},697.91439195002704,9.8659605395173973,null,1684.6329990334179,null,0,null,5319.686314694407,null,4289.0667015858926,null,4943.1269221724906,null,824.1433192032755,null,0]
[390,null,1684.6329990334179,null,1583.7187747501821,null,5319.686314694407,null,4289.0667015858926,null,4943.1269221724906,null,824.1433192032755,null,{"$f":"HLOOKUP(P409,C409:$M$520,A909,0)","v":"F"},824.1433192032755,10.030916715495385,null,860.48967983014245,null,759.5754555469066,null,4495.5429954911315,null,3464.9233823826171,null,4118.9836029692151,null,0,null,0]
[391,null,860.48967983014245,null,759.5754555469066,null,4495.5429954911315,null,3464.9233823826171,null,4118.9836029692151,null,2745.106029955135,null,{"$f":"HLOOKUP(P410,C410:$M$520,A910,0)","v":"B"},759.5754555469066,8.9271928336221507,null,100.91422428323585,null,0,null,3735.9675399442249,null,2705.3479268357105,null,3359.4081474223085,null,1985.5305744082284,null,0]
[392,null,100.91422428323585,null,2505.5483151199369,null,3735.9675399442249,null,2705.3479268357105,null,3359.4081474223085,null,1985.5305744082284,null,{"$f":"HLOOKUP(P411,C411:$M$520,A911,0)","v":"A"},100.91422428323585,10.036646296191098,null,0,null,2404.634090836701,null,3635.053315660989,null,2604.4337025524746,null,3258.4939231390726,null,1884.6163501249926,null,0]
[393,null,3843.8152372170002,null,2404.634090836701,null,3635.053315660989,null,2604.4337025524746,null,3258.4939231390726,null,1884.6163501249926,null,{"$f":"HLOOKUP(P412,C412:$M$520,A912,0)","v":"F"},1884.6163501249926,10.334612396726483,null,1959.1988870920077,null,520.01774071170848,null,1750.4369655359965,null,719.81735242748209,null,1373.8775730140801,null,0,null,0]
[394,null,1959.1988870920077,null,520.01774071170848,null,1750.4369655359965,null,719.81735242748209,null,1373.8775730140801,null,1531.6388860548539,null,{"$f":"HLOOKUP(P413,C413:$M$520,A913,0)","v":"B"},520.01774071170848,10.363348844557429,null,1439.1811463802992,null,0,null,1230.419224824288,null,199.79961171577361,null,853.85983230237161,null,1011.6211453431454,null,0]
[395,null,1439.1811463802992,null,1837.4435604185001,null,1230.419224824288,null,199.79961171577361,null,853.85983230237161,null,1011.6211453431454,null,{"$f":"HLOOKUP(P414,C414:$M$520,A914,0)","v":"D"},199.79961171577361,9.7504242722481802,null,1239.3815346645256,null,1637.6439487027264,null,1030.6196131085144,null,0,null,654.06022058659801,null,811.82153362737176,null,0]
[396,null,1239.3815346645256,null,1637.6439487027264,null,1030.6196131085144,null,2287.4576398682325,null,654.06022058659801,null,811.82153362737176,null,{"$f":"HLOOKUP(P415,C415:$M$520,A915,0)","v":"E"},654.06022058659801,9.4855338672239995,null,585.32131407792758,null,983.58372811612844,null,376.55939252191638,null,1633.3974192816345,null,0,null,157.76131304077376,null,0]
[397,null,585.32131407792758,null,983.58372811612844,null,376.55939252191638,null,1633.3974192816345,null,6490.6907406482314,null,157.76131304077376,null,{"$f":"HLOOKUP(P416,C416:$M$520,A916,0)","v":"F"},157.76131304077376,9.7899830991121775,null,427.56000103715382,null,825.82241507535468,null,218.79807948114262,null,1475.6361062408607,null,6332.9294276074579,null,0,null,0]
[398,null,427.56000103715382,null,825.82241507535468,null,218.79807948114262,null,1475.6361062408607,null,6332.9294276074579,null,1693.8289877492916,null,{"$f":"HLOOKUP(P417,C417:$M$520,A917,0)","v":"C"},218.79807948114262,9.7543896829767736,null,208.7619215560112,null,607.02433559421206,null,0,null,1256.8380267597181,null,6114.1313481263151,null,1475.030908268149,null,0]
[399,null,208.7619215560112,null,607.02433559421206,null,1941.7350983138849,null,1256.8380267597181,null,6114.1313481263151,null,1475.030908268149,null,{"$f":"HLOOKUP(P418,C418:$M$520,A918,0)","v":"A"},208.7619215560112,10.870953331935867,null,0,null,398.26241403820086,null,1732.9731767578737,null,1048.0761052037069,null,5905.3694265703034,null,1266.2689867121378,null,0]
[400,null,4982.3165382634443,null,398.26241403820086,null,1732.9731767578737,null,1048.0761052037069,null,5905.3694265703034,null,1266.2689867121378,null,{"$f":"HLOOKUP(P419,C419:$M$520,A919,0)","v":"B"},398.26241403820086,10.132856678533983,null,4584.0541242252439,null,0,null,1334.7107627196729,null,649.81369116550604,null,5507.1070125321021,null,868.00657267393694,null,0]
[401,null,4584.0541242252439,null,1792.2841744686732,null,1334.7107627196729,null,649.81369116550604,null,5507.1070125321021,null,868.00657267393694,null,{"$f":"HLOOKUP(P420,C420:$M$520,A920,0)","v":"D"},649.81369116550604,9.2553113497259183,null,3934.2404330597378,null,1142.4704833031672,null,684.89707155416681,null,0,null,4857.2933213665965,null,218.1928815084309,null,0]
[402,null,3934.2404330597378,null,1142.4704833031672,null,684.89707155416681,null,4134.6673127774447,null,4857.2933213665965,null,218.1928815084309,null,{"$f":"HLOOKUP(P421,C421:$M$520,A921,0)","v":"F"},218.1928815084309,10.510841000260257,null,3716.0475515513072,null,924.27760179473626,null,466.70419004573591,null,3916.4744312690136,null,4639.1004398581654,null,0,null,0]
[403,null,3716.0475515513072,null,924.27760179473626,null,466.70419004573591,null,3916.4744312690136,null,4639.1004398581654,null,2764.7393898823948,null,{"$f":"HLOOKUP(P422,C422:$M$520,A922,0)","v":"C"},466.70419004573591,9.466612064876113,null,3249.343361505571,null,457.57341174900034,null,0,null,3449.7702412232775,null,4172.3962498124292,null,2298.0351998366586,null,0]
[404,null,3249.343361505571,null,457.57341174900034,null,3368.576940210713,null,3449.7702412232775,null,4172.3962498124292,null,2298.0351998366586,null,{"$f":"HLOOKUP(P423,C423:$M$520,A923,0)","v":"B"},457.57341174900034,8.7911606542107315,null,2791.7699497565709,null,0,null,2911.0035284617124,null,2992.1968294742774,null,3714.8228380634291,null,1840.4617880876583,null,0]
[405,null,2791.7699497565709,null,1923.8225827397175,null,2911.0035284617124,null,2992.1968294742774,null,3714.8228380634291,null,1840.4617880876583,null,{"$f":"HLOOKUP(P424,C424:$M$520,A924,0)","v":"F"},1840.4617880876583,9.6857022886340527,null,951.30816166891259,null,83.360794652059212,null,1070.5417403740541,null,1151.7350413866191,null,1874.3610499757708,null,0,null,0]
[406,null,951.30816166891259,null,83.360794652059212,null,1070.5417403740541,null,1151.7350413866191,null,1874.3610499757708,null,1929.8641879893105,null,{"$f":"HLOOKUP(P425,C425:$M$520,A925,0)","v":"B"},83.360794652059212,9.3478309703494151,null,867.94736701685338,null,0,null,987.18094572199493,null,1068.3742467345598,null,1791.0002553237116,null,1846.5033933372513,null,1]
[407,null,867.94736701685338,null,2363.8346697731658,null,987.18094572199493,null,1068.3742467345598,null,1791.0002553237116,null,1846.5033933372513,null,{"$f":"HLOOKUP(P426,C426:$M$520,A926,0)","v":"A"},867.94736701685338,10.404377663705745,null,0,null,1495.8873027563125,null,119.23357870514155,null,200.42687971770647,null,923.05288830685822,null,978.5560263203979,null,0]
[408,null,4039.8259282301965,null,1495.8873027563125,null,119.23357870514155,null,200.42687971770647,null,923.05288830685822,null,978.5560263203979,null,{"$f":"HLOOKUP(P427,C427:$M$520,A927,0)","v":"C"},119.23357870514155,9.6302676636011313,null,3920.5923495250549,null,1376.6537240511709,null,0,null,81.193301012564916,null,803.81930960171667,null,859.32244761525635,null,0]
[409,null,3920.5923495250549,null,1376.6537240511709,null,5697.3168395815392,null,81.193301012564916,null,803.81930960171667,null,859.32244761525635,null,{"$f":"HLOOKUP(P428,C428:$M$520,A928,0)","v":"D"},81.193301012564916,9.7236654634396995,null,3839.39904851249,null,1295.460423038606,null,5616.1235385689743,null,0,null,722.62600858915175,null,778.12914660269143,null,1]
[410,null,3839.39904851249,null,1295.460423038606,null,5616.1235385689743,null,5013.1124800676535,null,722.62600858915175,null,778.12914660269143,null,{"$f":"HLOOKUP(P429,C429:$M$520,A929,0)","v":"E"},722.62600858915175,10.065403830038502,null,3116.7730399233383,null,572.83441444945424,null,4893.4975299798225,null,4290.4864714785017,null,0,null,55.503138013539683,null,0]
[411,null,3116.7730399233383,null,572.83441444945424,null,4893.4975299798225,null,4290.4864714785017,null,3192.8004363292016,null,55.503138013539683,null,{"$f":"HLOOKUP(P430,C430:$M$520,A930,0)","v":"F"},55.503138013539683,10.483536864444188,null,3061.2699019097986,null,517.33127643591456,null,4837.9943919662828,null,4234.983333464962,null,3137.2972983156619,null,0,null,1]
[412,null,3061.2699019097986,null,517.33127643591456,null,4837.9943919662828,null,4234.983333464962,null,3137.2972983156619,null,3221.0486517631257,null,{"$f":"HLOOKUP(P431,C431:$M$520,A931,0)","v":"B"},517.33127643591456,8.7996180811953497,null,2543.9386254738838,null,0,null,4320.6631155303685,null,3717.6520570290477,null,2619.9660218797471,null,2703.7173753272109,null,0]
[413,null,2543.9386254738838,null,2476.148889526291,null,4320.6631155303685,null,3717.6520570290477,null,2619.9660218797471,null,2703.7173753272109,null,{"$f":"HLOOKUP(P432,C432:$M$520,A932,0)","v":"B"},2476.148889526291,10.280354246494518,null,67.789735947592817,null,0,null,1844.5142260040775,null,1241.5031675027567,null,143.81713235345615,null,227.56848580091992,null,0]
[414,null,67.789735947592817,null,2118.2592390298651,null,1844.5142260040775,null,1241.5031675027567,null,143.81713235345615,null,227.56848580091992,null,{"$f":"HLOOKUP(P433,C433:$M$520,A933,0)","v":"A"},67.789735947592817,10.055592086805868,null,0,null,2050.4695030822722,null,1776.7244900564847,null,1173.7134315551639,null,76.027396405863328,null,159.7787498533271,null,1]
[415,null,3559.9898118275842,null,2050.4695030822722,null,1776.7244900564847,null,1173.7134315551639,null,76.027396405863328,null,159.7787498533271,null,{"$f":"HLOOKUP(P434,C434:$M$520,A934,0)","v":"E"},76.027396405863328,8.7556032853687231,null,3483.9624154217208,null,1974.4421066764089,null,1700.6970936506214,null,1097.6860351493006,null,0,null,83.751353447463771,null,1]
[416,null,3483.9624154217208,null,1974.4421066764089,null,1700.6970936506214,null,1097.6860351493006,null,3272.4792656314889,null,83.751353447463771,null,{"$f":"HLOOKUP(P435,C435:$M$520,A935,0)","v":"F"},83.751353447463771,9.2620386178294751,null,3400.2110619742571,null,1890.6907532289451,null,1616.9457402031576,null,1013.9346817018368,null,3188.7279121840252,null,0,null,1]
[417,null,3400.2110619742571,null,1890.6907532289451,null,1616.9457402031576,null,1013.9346817018368,null,3188.7279121840252,null,2356.4507567963392,null,{"$f":"HLOOKUP(P436,C436:$M$520,A936,0)","v":"D"},1013.9346817018368,11.727921209010894,null,2386.2763802724203,null,876.75607152710836,null,603.0110585013208,null,0,null,2174.7932304821884,null,1342.5160750945024,null,0]
[418,null,2386.2763802724203,null,876.75607152710836,null,603.0110585013208,null,4585.6685142796805,null,2174.7932304821884,null,1342.5160750945024,null,{"$f":"HLOOKUP(P437,C437:$M$520,A937,0)","v":"C"},603.0110585013208,10.951401109198152,null,1783.2653217710995,null,273.74501302578756,null,0,null,3982.6574557783597,null,1571.7821719808676,null,739.50501659318161,null,0]
[419,null,1783.2653217710995,null,273.74501302578756,null,3100.3544091253875,null,3982.6574557783597,null,1571.7821719808676,null,739.50501659318161,null,{"$f":"HLOOKUP(P438,C438:$M$520,A938,0)","v":"B"},273.74501302578756,8.9435889776847812,null,1509.5203087453119,null,0,null,2826.6093960996,null,3708.9124427525721,null,1298.03715895508,null,465.76000356739405,null,0]
[420,null,1509.5203087453119,null,2070.2290893229483,null,2826.6093960996,null,3708.9124427525721,null,1298.03715895508,null,465.76000356739405,null,{"$f":"HLOOKUP(P439,C439:$M$520,A939,0)","v":"F"},465.76000356739405,10.814938842008006,null,1043.7603051779179,null,1604.4690857555543,null,2360.8493925322059,null,3243.1524391851781,null,832.27715538768598,null,0,null,0]
[421,null,1043.7603051779179,null,1604.4690857555543,null,2360.8493925322059,null,3243.1524391851781,null,832.27715538768598,null,1780.6270928848712,null,{"$f":"HLOOKUP(P440,C440:$M$520,A940,0)","v":"E"},832.27715538768598,10.007841681502727,null,211.48314979023189,null,772.19193036786828,null,1528.5722371445199,null,2410.8752837974921,null,0,null,948.34993749718524,null,0]
[422,null,211.48314979023189,null,772.19193036786828,null,1528.5722371445199,null,2410.8752837974921,null,2503.1917262214392,null,948.34993749718524,null,{"$f":"HLOOKUP(P441,C441:$M$520,A941,0)","v":"A"},211.48314979023189,10.324012737578004,null,0,null,560.70878057763639,null,1317.089087354288,null,2199.3921340072602,null,2291.7085764312073,null,736.86678770695335,null,0]
[423,null,3558.081998128278,null,560.70878057763639,null,1317.089087354288,null,2199.3921340072602,null,2291.7085764312073,null,736.86678770695335,null,{"$f":"HLOOKUP(P442,C442:$M$520,A942,0)","v":"B"},560.70878057763639,10.097538109353058,null,2997.3732175506416,null,0,null,756.38030677665165,null,1638.6833534296238,null,1730.999795853571,null,176.15800712931696,null,0]
[424,null,2997.3732175506416,null,1441.6385913107854,null,756.38030677665165,null,1638.6833534296238,null,1730.999795853571,null,176.15800712931696,null,{"$f":"HLOOKUP(P443,C443:$M$520,A943,0)","v":"F"},176.15800712931696,11.378776335889563,null,2821.2152104213246,null,1265.4805841814684,null,580.22229964733469,null,1462.5253463003069,null,1554.841788724254,null,0,null,0]
[425,null,2821.2152104213246,null,1265.4805841814684,null,580.22229964733469,null,1462.5253463003069,null,1554.841788724254,null,2301.1570727429389,null,{"$f":"HLOOKUP(P444,C444:$M$520,A944,0)","v":"C"},580.22229964733469,10.300003214552685,null,2240.9929107739899,null,685.25828453413374,null,0,null,882.30304665297217,null,974.61948907691931,null,1720.9347730956042,null,0]
[426,null,2240.9929107739899,null,685.25828453413374,null,5277.0338923366062,null,882.30304665297217,null,974.61948907691931,null,1720.9347730956042,null,{"$f":"HLOOKUP(P445,C445:$M$520,A945,0)","v":"B"},685.25828453413374,11.836298557928705,null,1555.7346262398562,null,0,null,4591.7756078024722,null,197.04476211883843,null,289.36120454278557,null,1035.6764885614705,null,0]
[427,null,1555.7346262398562,null,1845.7967109452611,null,4591.7756078024722,null,197.04476211883843,null,289.36120454278557,null,1035.6764885614705,null,{"$f":"HLOOKUP(P446,C446:$M$520,A946,0)","v":"D"},197.04476211883843,11.28432102473316,null,1358.6898641210178,null,1648.7519488264227,null,4394.7308456836336,null,0,null,92.316442423947137,null,838.63172644263204,null,0]
[428,null,1358.6898641210178,null,1648.7519488264227,null,4394.7308456836336,null,4324.0200190892083,null,92.316442423947137,null,838.63172644263204,null,{"$f":"HLOOKUP(P447,C447:$M$520,A947,0)","v":"E"},92.316442423947137,10.799394053668372,null,1266.3734216970706,null,1556.4355064024755,null,4302.4144032596869,null,4231.7035766652607,null,0,null,746.31528401868491,null,1]
[429,null,1266.3734216970706,null,1556.4355064024755,null,4302.4144032596869,null,4231.7035766652607,null,3825.313990566789,null,746.31528401868491,null,{"$f":"HLOOKUP(P448,C448:$M$520,A948,0)","v":"F"},746.31528401868491,9.1031232761031298,null,520.05813767838572,null,810.12022238379063,null,3556.099119241002,null,3485.3882926465758,null,3078.9987065481041,null,0,null,0]
[430,null,520.05813767838572,null,810.12022238379063,null,3556.099119241002,null,3485.3882926465758,null,3078.9987065481041,null,1689.0397115280448,null,{"$f":"HLOOKUP(P449,C449:$M$520,A949,0)","v":"A"},520.05813767838572,9.4064865625706364,null,0,null,290.06208470540491,null,3036.0409815626163,null,2965.3301549681901,null,2558.9405688697184,null,1168.9815738496591,null,0]
[431,null,3748.8190605173513,null,290.06208470540491,null,3036.0409815626163,null,2965.3301549681901,null,2558.9405688697184,null,1168.9815738496591,null,{"$f":"HLOOKUP(P450,C450:$M$520,A950,0)","v":"B"},290.06208470540491,10.821657903244189,null,3458.7569758119462,null,0,null,2745.9788968572111,null,2675.2680702627849,null,2268.8784841643137,null,878.91948914425416,null,0]
[432,null,3458.7569758119462,null,1917.7217250130379,null,2745.9788968572111,null,2675.2680702627849,null,2268.8784841643137,null,878.91948914425416,null,{"$f":"HLOOKUP(P451,C451:$M$520,A951,0)","v":"F"},878.91948914425416,10.467627317074504,null,2579.8374866676922,null,1038.8022358687838,null,1867.059407712957,null,1796.3485811185308,null,1389.9589950200595,null,0,null,0]
[433,null,2579.8374866676922,null,1038.8022358687838,null,1867.059407712957,null,1796.3485811185308,null,1389.9589950200595,null,1862.866271102627,null,{"$f":"HLOOKUP(P452,C452:$M$520,A952,0)","v":"B"},1038.8022358687838,10.163523839834117,null,1541.0352507989085,null,0,null,828.25717184417317,null,757.54634524974699,null,351.15675915127576,null,824.06403523384324,null,0]
[434,null,1541.0352507989085,null,2351.1564505569249,null,828.25717184417317,null,757.54634524974699,null,351.15675915127576,null,824.06403523384324,null,{"$f":"HLOOKUP(P453,C453:$M$520,A953,0)","v":"E"},351.15675915127576,11.17721561099,null,1189.8784916476327,null,1999.9996914056492,null,477.10041269289741,null,406.38958609847123,null,0,null,472.90727608256748,null,0]
[435,null,1189.8784916476327,null,1999.9996914056492,null,477.10041269289741,null,406.38958609847123,null,5410.7537863624248,null,472.90727608256748,null,{"$f":"HLOOKUP(P454,C454:$M$520,A954,0)","v":"D"},406.38958609847123,9.3834457854481474,null,783.48890554916147,null,1593.6101053071779,null,70.71082659442618,null,0,null,5004.3642002639535,null,66.517689984096251,null,0]
[436,null,783.48890554916147,null,1593.6101053071779,null,70.71082659442618,null,5152.5219821683968,null,5004.3642002639535,null,66.517689984096251,null,{"$f":"HLOOKUP(P455,C455:$M$520,A955,0)","v":"F"},66.517689984096251,9.4448602971372839,null,716.97121556506522,null,1527.0924153230817,null,4.1931366103299297,null,5086.0042921843005,null,4937.8465102798573,null,0,null,1]
[437,null,716.97121556506522,null,1527.0924153230817,null,4.1931366103299297,null,5086.0042921843005,null,4937.8465102798573,null,2407.6763033023462,null,{"$f":"HLOOKUP(P456,C456:$M$520,A956,0)","v":"C"},4.1931366103299297,9.4892413155473161,null,712.77807895473529,null,1522.8992787127518,null,0,null,5081.8111555739706,null,4933.6533736695274,null,2403.4831666920163,null,1]
[438,null,712.77807895473529,null,1522.8992787127518,null,4869.2952260145994,null,5081.8111555739706,null,4933.6533736695274,null,2403.4831666920163,null,{"$f":"HLOOKUP(P457,C457:$M$520,A957,0)","v":"A"},712.77807895473529,9.9765121351731096,null,0,null,810.12119975801647,null,4156.5171470598643,null,4369.0330766192355,null,4220.8752947147923,null,1690.705087737281,null,0]
[439,null,2704.4563505170004,null,810.12119975801647,null,4156.5171470598643,null,4369.0330766192355,null,4220.8752947147923,null,1690.705087737281,null,{"$f":"HLOOKUP(P458,C458:$M$520,A958,0)","v":"B"},810.12119975801647,8.4411184668160057,null,1894.3351507589839,null,0,null,3346.3959473018476,null,3558.9118768612188,null,3410.7540949567756,null,880.58388797926455,null,0]
[440,null,1894.3351507589839,null,2661.132534525419,null,3346.3959473018476,null,3558.9118768612188,null,3410.7540949567756,null,880.58388797926455,null,{"$f":"HLOOKUP(P459,C459:$M$520,A959,0)","v":"F"},880.58388797926455,8.541707634120062,null,1013.7512627797194,null,1780.5486465461545,null,2465.8120593225831,null,2678.3279888819543,null,2530.170206977511,null,0,null,0]
[441,null,1013.7512627797194,null,1780.5486465461545,null,2465.8120593225831,null,2678.3279888819543,null,2530.170206977511,null,3759.4218506480947,null,{"$f":"HLOOKUP(P460,C460:$M$520,A960,0)","v":"A"},1013.7512627797194,11.047918408253448,null,0,null,766.79738376643513,null,1452.0607965428637,null,1664.5767261022349,null,1516.4189441977917,null,2745.6705878683752,null,0]
[442,null,3582.7559995516067,null,766.79738376643513,null,1452.0607965428637,null,1664.5767261022349,null,1516.4189441977917,null,2745.6705878683752,null,{"$f":"HLOOKUP(P461,C461:$M$520,A961,0)","v":"B"},766.79738376643513,9.7685849149934096,null,2815.9586157851718,null,0,null,685.26341277642859,null,897.77934233579981,null,749.62156043135656,null,1978.87320410194,null,0]
[443,null,2815.9586157851718,null,2327.3428568311665,null,685.26341277642859,null,897.77934233579981,null,749.62156043135656,null,1978.87320410194,null,{"$f":"HLOOKUP(P462,C462:$M$520,A962,0)","v":"C"},685.26341277642859,9.5987178966417677,null,2130.6952030087432,null,1642.0794440547379,null,0,null,212.51592955937122,null,64.358147654927961,null,1293.6097913255114,null,0]
[444,null,2130.6952030087432,null,1642.0794440547379,null,6147.5336748208265,null,212.51592955937122,null,64.358147654927961,null,1293.6097913255114,null,{"$f":"HLOOKUP(P463,C463:$M$520,A963,0)","v":"E"},64.358147654927961,8.9972893702224273,null,2066.3370553538152,null,1577.7212963998099,null,6083.1755271658985,null,148.15778190444325,null,0,null,1229.2516436705835,null,1]
[445,null,2066.3370553538152,null,1577.7212963998099,null,6083.1755271658985,null,148.15778190444325,null,6172.4157742188609,null,1229.2516436705835,null,{"$f":"HLOOKUP(P464,C464:$M$520,A964,0)","v":"D"},148.15778190444325,9.66869241036399,null,1918.179273449372,null,1429.5635144953667,null,5935.0177452614553,null,0,null,6024.2579923144176,null,1081.0938617661402,null,0]
[446,null,1918.179273449372,null,1429.5635144953667,null,5935.0177452614553,null,5338.7482829495184,null,6024.2579923144176,null,1081.0938617661402,null,{"$f":"HLOOKUP(P465,C465:$M$520,A965,0)","v":"F"},1081.0938617661402,10.776917700030898,null,837.08541168323177,null,348.46965272922648,null,4853.9238834953148,null,4257.654421183378,null,4943.1641305482772,null,0,null,0]
[447,null,837.08541168323177,null,348.46965272922648,null,4853.9238834953148,null,4257.654421183378,null,4943.1641305482772,null,3016.9512339300745,null,{"$f":"HLOOKUP(P466,C466:$M$520,A966,0)","v":"B"},348.46965272922648,9.917452101585674,null,488.61575895400529,null,0,null,4505.4542307660886,null,3909.1847684541517,null,4594.6944778190509,null,2668.4815812008483,null,0]
[448,null,488.61575895400529,null,2930.8542317398978,null,4505.4542307660886,null,3909.1847684541517,null,4594.6944778190509,null,2668.4815812008483,null,{"$f":"HLOOKUP(P467,C467:$M$520,A967,0)","v":"A"},488.61575895400529,10.259070521560943,null,0,null,2442.2384727858926,null,4016.8384718120833,null,3420.5690095001464,null,4106.0787188650456,null,2179.865822246843,null,0]
[449,null,3059.4291523287288,null,2442.2384727858926,null,4016.8384718120833,null,3420.5690095001464,null,4106.0787188650456,null,2179.865822246843,null,{"$f":"HLOOKUP(P468,C468:$M$520,A968,0)","v":"F"},{"$f":"MIN(C468:M468)","v":2179.865822246843},{"$f":"IF(O468=C$19,EXP(NORMINV(RAND(),C$8,C$9)),IF(O468=E$19,EXP(NORMINV(RAND(),E$8,E$9)),IF(O468=G$19,EXP(NORMINV(RAND(),G$8,G$9)),IF(O468=I$19,EXP(NORMINV(RAND(),I$8,I$9)),IF(O468=K$19,EXP(NORMINV(RAND(),K$8,K$9)),IF(O468=M$19,EXP(NORMINV(RAND(),M$8,M$9))))))))","v":10.069541006392798},null,{"$f":"IF(OR(C$3=\"\",C$4=\"\"),\"\",IF($O468=S$19,0,C468-$P468))","v":879.56333008188585},null,{"$f":"IF(OR(E$3=\"\",E$4=\"\"),\"\",IF($O468=U$19,0,E468-$P468))","v":262.37265053904957},null,{"$f":"IF(OR(G$3=\"\",G$4=\"\"),\"\",IF($O468=W$19,0,G468-$P468))","v":1836.9726495652403},null,{"$f":"IF(OR(I$3=\"\",I$4=\"\"),\"\",IF($O468=Y$19,0,I468-$P468))","v":1240.7031872533034},null,{"$f":"IF(OR(K$3=\"\",K$4=\"\"),\"\",IF($O468=AA$19,0,K468-$P468))","v":1926.2128966182026},null,{"$f":"IF(OR(M$3=\"\",M$4=\"\"),\"\",IF($O468=AC$19,0,M468-$P468))","v":0},null,{"$f":"IF(P468>=$P$3,0,1)","v":0}]
[450,null,879.56333008188585,null,262.37265053904957,null,1836.9726495652403,null,1240.7031872533034,null,1926.2128966182026,null,1268.5737491424011,null,{"$f":"HLOOKUP(P469,C469:$M$520,A969,0)","v":"B"},262.37265053904957,10.557571760293065,null,617.19067954283628,null,0,null,1574.5999990261907,null,978.33053671425387,null,1663.8402460791531,null,1006.2010986033515,null,0]
[451,null,{"$f":"IF(OR(C$3=\"\",C$4=\"\"),\"\",IF(S469=0,C$2+C$4*(LN(1/(1-RAND())))^(1/C$3),S469))","v":617.19067954283628},null,{"$f":"IF(OR(E$3=\"\",E$4=\"\"),\"\",IF(U469=0,E$2+E$4*(LN(1/(1-RAND())))^(1/E$3),U469))","v":1835.3128113107127},null,{"$f":"IF(OR(G$3=\"\",G$4=\"\"),\"\",IF(W469=0,G$2+G$4*(LN(1/(1-RAND())))^(1/G$3),W469))","v":1574.5999990261907},null,{"$f":"IF(OR(I$3=\"\",I$4=\"\"),\"\",IF(Y469=0,I$2+I$4*(LN(1/(1-RAND())))^(1/I$3),Y469))","v":978.33053671425387},null,{"$f":"IF(OR(K$3=\"\",K$4=\"\"),\"\",IF(AA469=0,K$2+K$4*(LN(1/(1-RAND())))^(1/K$3),AA469))","v":1663.8402460791531},null,{"$f":"IF(OR(M$3=\"\",M$4=\"\"),\"\",IF(AC469=0,M$2+M$4*(LN(1/(1-RAND())))^(1/M$3),AC469))","v":1006.2010986033515},null,{"$f":"HLOOKUP(P470,C470:$M$520,A970,0)","v":"A"},617.19067954283628,11.381129876456779,null,0,null,1218.1221317678765,null,957.40931948335447,null,361.13985717141759,null,1046.6495665363168,null,389.01041906051523,null,0]
[452,null,4156.295587205479,null,1218.1221317678765,null,957.40931948335447,null,361.13985717141759,null,1046.6495665363168,null,389.01041906051523,null,{"$f":"HLOOKUP(P471,C471:$M$520,A971,0)","v":"D"},361.13985717141759,9.3863881777103639,null,3795.1557300340614,null,856.98227459645886,null,596.26946231193688,null,0,null,685.50970936489921,null,27.870561889097644,null,0]
[453,null,3795.1557300340614,null,856.98227459645886,null,596.26946231193688,null,4079.7210647658726,null,685.50970936489921,null,27.870561889097644,null,{"$f":"HLOOKUP(P472,C472:$M$520,A972,0)","v":"F"},27.870561889097644,9.3016321632891383,null,3767.2851681449638,null,829.11171270736122,null,568.39890042283923,null,4051.850502876775,null,657.63914747580156,null,0,null,1]
[454,null,3767.2851681449638,null,829.11171270736122,null,568.39890042283923,null,4051.850502876775,null,657.63914747580156,null,2711.8781358389097,null,{"$f":"HLOOKUP(P473,C473:$M$520,A973,0)","v":"C"},568.39890042283923,9.7835842035801139,null,3198.8862677221246,null,260.71281228452199,null,0,null,3483.4516024539357,null,89.240247052962332,null,2143.4792354160704,null,0]
[455,null,3198.8862677221246,null,260.71281228452199,null,7206.3289645251607,null,3483.4516024539357,null,89.240247052962332,null,2143.4792354160704,null,{"$f":"HLOOKUP(P474,C474:$M$520,A974,0)","v":"E"},89.240247052962332,9.3313310952762958,null,3109.6460206691622,null,171.47256523155966,null,7117.0887174721984,null,3394.2113554009734,null,0,null,2054.2389883631081,null,1]
[456,null,3109.6460206691622,null,171.47256523155966,null,7117.0887174721984,null,3394.2113554009734,null,6233.2967459258989,null,2054.2389883631081,null,{"$f":"HLOOKUP(P475,C475:$M$520,A975,0)","v":"B"},171.47256523155966,9.8032019381211626,null,2938.1734554376026,null,0,null,6945.6161522406383,null,3222.7387901694137,null,6061.8241806943388,null,1882.7664231315484,null,0]
[457,null,2938.1734554376026,null,1745.6720329125394,null,6945.6161522406383,null,3222.7387901694137,null,6061.8241806943388,null,1882.7664231315484,null,{"$f":"HLOOKUP(P476,C476:$M$520,A976,0)","v":"B"},1745.6720329125394,8.7856586333170661,null,1192.5014225250632,null,0,null,5199.9441193280991,null,1477.0667572568743,null,4316.1521477817996,null,137.09439021900903,null,0]
[458,null,1192.5014225250632,null,2206.930366944769,null,5199.9441193280991,null,1477.0667572568743,null,4316.1521477817996,null,137.09439021900903,null,{"$f":"HLOOKUP(P477,C477:$M$520,A977,0)","v":"F"},137.09439021900903,9.5673278904307946,null,1055.4070323060541,null,2069.8359767257598,null,5062.8497291090898,null,1339.9723670378653,null,4179.0577575627904,null,0,null,0]
[459,null,1055.4070323060541,null,2069.8359767257598,null,5062.8497291090898,null,1339.9723670378653,null,4179.0577575627904,null,1914.2573604653737,null,{"$f":"HLOOKUP(P478,C478:$M$520,A978,0)","v":"A"},1055.4070323060541,9.1633209039829318,null,0,null,1014.4289444197057,null,4007.4426968030357,null,284.56533473181116,null,3123.6507252567362,null,858.85032815931959,null,0]
[460,null,2642.7446416041116,null,1014.4289444197057,null,4007.4426968030357,null,284.56533473181116,null,3123.6507252567362,null,858.85032815931959,null,{"$f":"HLOOKUP(P479,C479:$M$520,A979,0)","v":"D"},284.56533473181116,10.406908990116236,null,2358.1793068723005,null,729.8636096878945,null,3722.8773620712245,null,0,null,2839.0853905249251,null,574.28499342750843,null,0]
[461,null,2358.1793068723005,null,729.8636096878945,null,3722.8773620712245,null,5855.4122275427271,null,2839.0853905249251,null,574.28499342750843,null,{"$f":"HLOOKUP(P480,C480:$M$520,A980,0)","v":"F"},574.28499342750843,10.646465778407956,null,1783.894313444792,null,155.57861626038607,null,3148.5923686437163,null,5281.1272341152189,null,2264.8003970974169,null,0,null,0]
[462,null,1783.894313444792,null,155.57861626038607,null,3148.5923686437163,null,5281.1272341152189,null,2264.8003970974169,null,2400.938857692181,null,{"$f":"HLOOKUP(P481,C481:$M$520,A981,0)","v":"B"},155.57861626038607,10.265385580265566,null,1628.315697184406,null,0,null,2993.01375238333,null,5125.5486178548326,null,2109.2217808370306,null,2245.3602414317947,null,0]
[463,null,1628.315697184406,null,2028.9211427995019,null,2993.01375238333,null,5125.5486178548326,null,2109.2217808370306,null,2245.3602414317947,null,{"$f":"HLOOKUP(P482,C482:$M$520,A982,0)","v":"A"},1628.315697184406,10.22038735075933,null,0,null,400.60544561509596,null,1364.6980551989241,null,3497.2329206704267,null,480.9060836526246,null,617.04454424738879,null,0]
[464,null,3560.223763730442,null,400.60544561509596,null,1364.6980551989241,null,3497.2329206704267,null,480.9060836526246,null,617.04454424738879,null,{"$f":"HLOOKUP(P483,C483:$M$520,A983,0)","v":"B"},400.60544561509596,10.413124309371334,null,3159.618318115346,null,0,null,964.09260958382811,null,3096.6274750553307,null,80.300638037528643,null,216.43909863229283,null,0]
[465,null,3159.618318115346,null,2272.1273145708706,null,964.09260958382811,null,3096.6274750553307,null,80.300638037528643,null,216.43909863229283,null,{"$f":"HLOOKUP(P484,C484:$M$520,A984,0)","v":"E"},80.300638037528643,9.6209943800910676,null,3079.3176800778174,null,2191.8266765333419,null,883.79197154629946,null,3016.3268370178021,null,0,null,136.13846059476418,null,1]
[466,null,3079.3176800778174,null,2191.8266765333419,null,883.79197154629946,null,3016.3268370178021,null,2988.6771658855928,null,136.13846059476418,null,{"$f":"HLOOKUP(P485,C485:$M$520,A985,0)","v":"F"},136.13846059476418,10.838758141537941,null,2943.1792194830532,null,2055.6882159385777,null,747.65351095153528,null,2880.1883764230379,null,2852.5387052908286,null,0,null,0]
[467,null,2943.1792194830532,null,2055.6882159385777,null,747.65351095153528,null,2880.1883764230379,null,2852.5387052908286,null,2095.3332888008754,null,{"$f":"HLOOKUP(P486,C486:$M$520,A986,0)","v":"C"},747.65351095153528,9.1791216511001359,null,2195.5257085315179,null,1308.0347049870425,null,0,null,2132.5348654715026,null,2104.8851943392933,null,1347.6797778493401,null,0]
[468,null,2195.5257085315179,null,1308.0347049870425,null,3514.4528078794747,null,2132.5348654715026,null,2104.8851943392933,null,1347.6797778493401,null,{"$f":"HLOOKUP(P487,C487:$M$520,A987,0)","v":"B"},1308.0347049870425,9.5423422862440184,null,887.49100354447546,null,0,null,2206.4181028924322,null,824.50016048446014,null,796.85048935225086,null,39.645072862297638,null,0]
[469,null,887.49100354447546,null,2118.1699472008831,null,2206.4181028924322,null,824.50016048446014,null,796.85048935225086,null,39.645072862297638,null,{"$f":"HLOOKUP(P488,C488:$M$520,A988,0)","v":"F"},39.645072862297638,10.537076305091688,null,847.84593068217782,null,2078.5248743385855,null,2166.7730300301346,null,784.8550876221625,null,757.20541648995322,null,0,null,1]
[470,null,847.84593068217782,null,2078.5248743385855,null,2166.7730300301346,null,784.8550876221625,null,757.20541648995322,null,2161.7109716784844,null,{"$f":"HLOOKUP(P489,C489:$M$520,A989,0)","v":"E"},757.20541648995322,10.367902257427982,null,90.6405141922246,null,1321.3194578486323,null,1409.5676135401814,null,27.649671132209278,null,0,null,1404.5055551885312,null,0]
[471,null,90.6405141922246,null,1321.3194578486323,null,1409.5676135401814,null,27.649671132209278,null,3461.4469273189379,null,1404.5055551885312,null,{"$f":"HLOOKUP(P490,C490:$M$520,A990,0)","v":"D"},27.649671132209278,10.690926666658092,null,62.990843060015322,null,1293.669786716423,null,1381.9179424079721,null,0,null,3433.7972561867286,null,1376.8558840563219,null,1]
[472,null,62.990843060015322,null,1293.669786716423,null,1381.9179424079721,null,5838.47258425987,null,3433.7972561867286,null,1376.8558840563219,null,{"$f":"HLOOKUP(P491,C491:$M$520,A991,0)","v":"A"},62.990843060015322,10.014100975920247,null,0,null,1230.6789436564077,null,1318.9270993479568,null,5775.4817411998547,null,3370.8064131267133,null,1313.8650409963066,null,1]
[473,null,4547.0294418583308,null,1230.6789436564077,null,1318.9270993479568,null,5775.4817411998547,null,3370.8064131267133,null,1313.8650409963066,null,{"$f":"HLOOKUP(P492,C492:$M$520,A992,0)","v":"B"},1230.6789436564077,8.7526592381730843,null,3316.3504982019231,null,0,null,88.248155691549073,null,4544.802797543447,null,2140.1274694703056,null,83.186097339898879,null,0]
[474,null,3316.3504982019231,null,1619.9917301045248,null,88.248155691549073,null,4544.802797543447,null,2140.1274694703056,null,83.186097339898879,null,{"$f":"HLOOKUP(P493,C493:$M$520,A993,0)","v":"F"},83.186097339898879,8.5499445732799888,null,3233.1644008620242,null,1536.8056327646259,null,5.0620583516501938,null,4461.6167002035481,null,2056.9413721304068,null,0,null,1]
[475,null,3233.1644008620242,null,1536.8056327646259,null,5.0620583516501938,null,4461.6167002035481,null,2056.9413721304068,null,812.11468039740157,null,{"$f":"HLOOKUP(P494,C494:$M$520,A994,0)","v":"C"},5.0620583516501938,8.9561379788424329,null,3228.102342510374,null,1531.7435744129757,null,0,null,4456.5546418518979,null,2051.8793137787566,null,807.05262204575138,null,1]
[476,null,3228.102342510374,null,1531.7435744129757,null,2925.1404680140681,null,4456.5546418518979,null,2051.8793137787566,null,807.05262204575138,null,{"$f":"HLOOKUP(P495,C495:$M$520,A995,0)","v":"F"},807.05262204575138,10.730640603145593,null,2421.0497204646226,null,724.69095236722433,null,2118.0878459683167,null,3649.5020198061466,null,1244.8266917330052,null,0,null,0]
[477,null,2421.0497204646226,null,724.69095236722433,null,2118.0878459683167,null,3649.5020198061466,null,1244.8266917330052,null,2363.4567338209272,null,{"$f":"HLOOKUP(P496,C496:$M$520,A996,0)","v":"B"},724.69095236722433,10.940772972787345,null,1696.3587680973983,null,0,null,1393.3968936010924,null,2924.8110674389222,null,520.13573936578086,null,1638.7657814537029,null,0]
[478,null,1696.3587680973983,null,1615.0441583656052,null,1393.3968936010924,null,2924.8110674389222,null,520.13573936578086,null,1638.7657814537029,null,{"$f":"HLOOKUP(P497,C497:$M$520,A997,0)","v":"E"},520.13573936578086,9.3758498507536796,null,1176.2230287316174,null,1094.9084189998243,null,873.26115423531155,null,2404.6753280731414,null,0,null,1118.630042087922,null,0]
[479,null,1176.2230287316174,null,1094.9084189998243,null,873.26115423531155,null,2404.6753280731414,null,3789.3759411363849,null,1118.630042087922,null,{"$f":"HLOOKUP(P498,C498:$M$520,A998,0)","v":"C"},873.26115423531155,10.133837818725052,null,302.96187449630588,null,221.64726476451278,null,0,null,1531.4141738378298,null,2916.1147869010733,null,245.36888785261044,null,0]
[480,null,302.96187449630588,null,221.64726476451278,null,6581.6432585613538,null,1531.4141738378298,null,2916.1147869010733,null,245.36888785261044,null,{"$f":"HLOOKUP(P499,C499:$M$520,A999,0)","v":"B"},221.64726476451278,9.4576282119426072,null,81.314609731793098,null,0,null,6359.9959937968415,null,1309.766909073317,null,2694.4675221365605,null,23.721623088097658,null,0]
[481,null,81.314609731793098,null,1612.2572519289529,null,6359.9959937968415,null,1309.766909073317,null,2694.4675221365605,null,23.721623088097658,null,{"$f":"HLOOKUP(P500,C500:$M$520,A1000,0)","v":"F"},23.721623088097658,10.458802782401241,null,57.59298664369544,null,1588.5356288408552,null,6336.2743707087438,null,1286.0452859852194,null,2670.7458990484629,null,0,null,1]
[482,null,57.59298664369544,null,1588.5356288408552,null,6336.2743707087438,null,1286.0452859852194,null,2670.7458990484629,null,2762.9302674279947,null,{"$f":"HLOOKUP(P501,C501:$M$520,A1001,0)","v":"A"},57.59298664369544,9.7736402960759978,null,0,null,1530.9426421971598,null,6278.6813840650484,null,1228.4522993415239,null,2613.1529124047674,null,2705.3372807842993,null,1]
[483,null,3004.236516855819,null,1530.9426421971598,null,6278.6813840650484,null,1228.4522993415239,null,2613.1529124047674,null,2705.3372807842993,null,{"$f":"HLOOKUP(P502,C502:$M$520,A1002,0)","v":"D"},1228.4522993415239,10.177076232412551,null,1775.7842175142951,null,302.49034285563584,null,5050.2290847235245,null,0,null,1384.7006130632435,null,1476.8849814427754,null,0]
[484,null,1775.7842175142951,null,302.49034285563584,null,5050.2290847235245,null,3949.1490482042909,null,1384.7006130632435,null,1476.8849814427754,null,{"$f":"HLOOKUP(P503,C503:$M$520,A1003,0)","v":"B"},302.49034285563584,10.227775406899154,null,1473.2938746586592,null,0,null,4747.7387418678882,null,3646.6587053486551,null,1082.2102702076077,null,1174.3946385871395,null,0]
[485,null,1473.2938746586592,null,2396.0216537641136,null,4747.7387418678882,null,3646.6587053486551,null,1082.2102702076077,null,1174.3946385871395,null,{"$f":"HLOOKUP(P504,C504:$M$520,A1004,0)","v":"E"},1082.2102702076077,10.750902122548853,null,391.08360445105154,null,1313.8113835565059,null,3665.5284716602805,null,2564.4484351410474,null,0,null,92.184368379531861,null,0]
[486,null,391.08360445105154,null,1313.8113835565059,null,3665.5284716602805,null,2564.4484351410474,null,5500.4498831468682,null,92.184368379531861,null,{"$f":"HLOOKUP(P505,C505:$M$520,A1005,0)","v":"F"},92.184368379531861,9.2485754499479729,null,298.89923607151968,null,1221.6270151769741,null,3573.3441032807486,null,2472.2640667615156,null,5408.2655147673358,null,0,null,1]
[487,null,298.89923607151968,null,1221.6270151769741,null,3573.3441032807486,null,2472.2640667615156,null,5408.2655147673358,null,3502.3426129185054,null,{"$f":"HLOOKUP(P506,C506:$M$520,A1006,0)","v":"A"},298.89923607151968,9.9104297583631595,null,0,null,922.72777910545437,null,3274.444867209229,null,2173.3648306899959,null,5109.3662786958157,null,3203.4433768469858,null,0]
[488,null,4844.3793682758023,null,922.72777910545437,null,3274.444867209229,null,2173.3648306899959,null,5109.3662786958157,null,3203.4433768469858,null,{"$f":"HLOOKUP(P507,C507:$M$520,A1007,0)","v":"B"},922.72777910545437,8.8465758475766521,null,3921.651589170348,null,0,null,2351.7170881037746,null,1250.6370515845415,null,4186.6384995903609,null,2280.7155977415314,null,0]
[489,null,3921.651589170348,null,1768.8286807844499,null,2351.7170881037746,null,1250.6370515845415,null,4186.6384995903609,null,2280.7155977415314,null,{"$f":"HLOOKUP(P508,C508:$M$520,A1008,0)","v":"D"},1250.6370515845415,9.5301214924169173,null,2671.0145375858065,null,518.19162919990845,null,1101.0800365192331,null,0,null,2936.0014480058194,null,1030.0785461569899,null,0]
[490,null,2671.0145375858065,null,518.19162919990845,null,1101.0800365192331,null,3533.3022026779645,null,2936.0014480058194,null,1030.0785461569899,null,{"$f":"HLOOKUP(P509,C509:$M$520,A1009,0)","v":"B"},518.19162919990845,10.514932771951164,null,2152.8229083858978,null,0,null,582.88840731932464,null,3015.1105734780558,null,2417.8098188059112,null,511.88691695708144,null,0]
[491,null,2152.8229083858978,null,1635.3373833217147,null,582.88840731932464,null,3015.1105734780558,null,2417.8098188059112,null,511.88691695708144,null,{"$f":"HLOOKUP(P510,C510:$M$520,A1010,0)","v":"F"},511.88691695708144,10.536049350748543,null,1640.9359914288164,null,1123.4504663646333,null,71.001490362243203,null,2503.2236565209741,null,1905.9229018488297,null,0,null,0]
[492,null,1640.9359914288164,null,1123.4504663646333,null,71.001490362243203,null,2503.2236565209741,null,1905.9229018488297,null,2068.9560446980618,null,{"$f":"HLOOKUP(P511,C511:$M$520,A1011,0)","v":"C"},71.001490362243203,9.4003806072778975,null,1569.9345010665731,null,1052.4489760023901,null,0,null,2432.2221661587309,null,1834.9214114865865,null,1997.9545543358186,null,1]
[493,null,1569.9345010665731,null,1052.4489760023901,null,3710.9193309902603,null,2432.2221661587309,null,1834.9214114865865,null,1997.9545543358186,null,{"$f":"HLOOKUP(P512,C512:$M$520,A1012,0)","v":"B"},1052.4489760023901,9.3539273976008861,null,517.48552506418309,null,0,null,2658.4703549878705,null,1379.7731901563409,null,782.47243548419647,null,945.5055783334285,null,0]
[494,null,517.48552506418309,null,1785.680757122504,null,2658.4703549878705,null,1379.7731901563409,null,782.47243548419647,null,945.5055783334285,null,{"$f":"HLOOKUP(P513,C513:$M$520,A1013,0)","v":"A"},517.48552506418309,10.712687539626769,null,0,null,1268.1952320583209,null,2140.9848299236874,null,862.28766509215779,null,264.98691042001337,null,428.02005326924541,null,0]
[495,null,4688.726180177031,null,1268.1952320583209,null,2140.9848299236874,null,862.28766509215779,null,264.98691042001337,null,428.02005326924541,null,{"$f":"HLOOKUP(P514,C514:$M$520,A1014,0)","v":"E"},264.98691042001337,9.5135110770068696,null,4423.7392697570176,null,1003.2083216383076,null,1875.997919503674,null,597.30075467214442,null,0,null,163.03314284923204,null,0]
[496,null,4423.7392697570176,null,1003.2083216383076,null,1875.997919503674,null,597.30075467214442,null,2077.1042776476634,null,163.03314284923204,null,{"$f":"HLOOKUP(P515,C515:$M$520,A1015,0)","v":"F"},163.03314284923204,9.086667039023876,null,4260.7061269077858,null,840.17517878907552,null,1712.9647766544419,null,434.26761182291239,null,1914.0711347984313,null,0,null,0]
[497,null,4260.7061269077858,null,840.17517878907552,null,1712.9647766544419,null,434.26761182291239,null,1914.0711347984313,null,1814.8167762062731,null,{"$f":"HLOOKUP(P516,C516:$M$520,A1016,0)","v":"D"},434.26761182291239,10.92752781984832,null,3826.4385150848734,null,405.90756696616313,null,1278.6971648315296,null,0,null,1479.8035229755189,null,1380.5491643833607,null,0]
[498,null,3826.4385150848734,null,405.90756696616313,null,1278.6971648315296,null,3454.1188642115781,null,1479.8035229755189,null,1380.5491643833607,null,{"$f":"HLOOKUP(P517,C517:$M$520,A1017,0)","v":"B"},405.90756696616313,11.354622744791252,null,3420.5309481187105,null,0,null,872.78959786536643,null,3048.2112972454152,null,1073.8959560093558,null,974.64159741719754,null,0]
[499,null,3420.5309481187105,null,2543.4593587045943,null,872.78959786536643,null,3048.2112972454152,null,1073.8959560093558,null,974.64159741719754,null,{"$f":"HLOOKUP(P518,C518:$M$520,A1018,0)","v":"C"},872.78959786536643,9.1438192473917947,null,2547.7413502533441,null,1670.6697608392278,null,0,null,2175.4216993800487,null,201.10635814398938,null,101.85199955183111,null,0]
[500,null,2547.7413502533441,null,1670.6697608392278,null,5229.7341170097088,null,2175.4216993800487,null,201.10635814398938,null,101.85199955183111,null,{"$f":"HLOOKUP(P519,C519:$M$520,A1019,0)","v":"F"},101.85199955183111,8.922712418759037,null,2445.8893507015127,null,1568.8177612873967,null,5127.8821174578779,null,2073.5696998282174,null,99.254358592158269,null,0,null,0]
[501,null,{"$f":"C19","v":"A"},null,{"$f":"E19","v":"B"},null,"C",null,"D",null,"E",null,"F"]
[500]
[499]
[498]
[497]
[496]
[495]
[494]
[493]
[492]
[491]
[490]
[489]
[488]
[487]
[486]
[485]
[484]
[483]
[482]
[481]
[480]
[479]
[478]
[477]
[476]
[475]
[474]
[473]
[472]
[471]
[470]
[469]
[468]
[467]
[466]
[465]
[464]
[463]
[462]
[461]
[460]
[459]
[458]
[457]
[456]
[455]
[454]
[453]
[452]
[451]
[450]
[449]
[448]
[447]
[446]
[445]
[444]
[443]
[442]
[441]
[440]
[439]
[438]
[437]
[436]
[435]
[434]
[433]
[432]
[431]
[430]
[429]
[428]
[427]
[426]
[425]
[424]
[423]
[422]
[421]
[420]
[419]
[418]
[417]
[416]
[415]
[414]
[413]
[412]
[411]
[410]
[409]
[408]
[407]
[406]
[405]
[404]
[403]
[402]
[401]
[400]
[399]
[398]
[397]
[396]
[395]
[394]
[393]
[392]
[391]
[390]
[389]
[388]
[387]
[386]
[385]
[384]
[383]
[382]
[381]
[380]
[379]
[378]
[377]
[376]
[375]
[374]
[373]
[372]
[371]
[370]
[369]
[368]
[367]
[366]
[365]
[364]
[363]
[362]
[361]
[360]
[359]
[358]
[357]
[356]
[355]
[354]
[353]
[352]
[351]
[350]
[349]
[348]
[347]
[346]
[345]
[344]
[343]
[342]
[341]
[340]
[339]
[338]
[337]
[336]
[335]
[334]
[333]
[332]
[331]
[330]
[329]
[328]
[327]
[326]
[325]
[324]
[323]
[322]
[321]
[320]
[319]
[318]
[317]
[316]
[315]
[314]
[313]
[312]
[311]
[310]
[309]
[308]
[307]
[306]
[305]
[304]
[303]
[302]
[301]
[300]
[299]
[298]
[297]
[296]
[295]
[294]
[293]
[292]
[291]
[290]
[289]
[288]
[287]
[286]
[285]
[284]
[283]
[282]
[281]
[280]
[279]
[278]
[277]
[276]
[275]
[274]
[273]
[272]
[271]
[270]
[269]
[268]
[267]
[266]
[265]
[264]
[263]
[262]
[261]
[260]
[259]
[258]
[257]
[256]
[255]
[254]
[253]
[252]
[251]
[250]
[249]
[248]
[247]
[246]
[245]
[244]
[243]
[242]
[241]
[240]
[239]
[238]
[237]
[236]
[235]
[234]
[233]
[232]
[231]
[230]
[229]
[228]
[227]
[226]
[225]
[224]
[223]
[222]
[221]
[220]
[219]
[218]
[217]
[216]
[215]
[214]
[213]
[212]
[211]
[210]
[209]
[208]
[207]
[206]
[205]
[204]
[203]
[202]
[201]
[200]
[199]
[198]
[197]
[196]
[195]
[194]
[193]
[192]
[191]
[190]
[189]
[188]
[187]
[186]
[185]
[184]
[183]
[182]
[181]
[180]
[179]
[178]
[177]
[176]
[175]
[174]
[173]
[172]
[171]
[170]
[169]
[168]
[167]
[166]
[165]
[164]
[163]
[162]
[161]
[160]
[159]
[158]
[157]
[156]
[155]
[154]
[153]
[152]
[151]
[150]
[149]
[148]
[147]
[146]
[145]
[144]
[143]
[142]
[141]
[140]
[139]
[138]
[137]
[136]
[135]
[134]
[133]
[132]
[131]
[130]
[129]
[128]
[127]
[126]
[125]
[124]
[123]
[122]
[121]
[120]
[119]
[118]
[117]
[116]
[115]
[114]
[113]
[112]
[111]
[110]
[109]
[108]
[107]
[106]
[105]
[104]
[103]
[102]
[101]
[100]
[99]
[98]
[97]
[96]
[95]
[94]
[93]
[92]
[91]
[90]
[89]
[88]
[87]
[86]
[85]
[84]
[83]
[82]
[81]
[80]
[79]
[78]
[77]
[76]
[75]
[74]
[73]
[72]
[71]
[70]
[69]
[68]
[67]
[66]
[65]
[64]
[63]
[62]
[61]
[60]
[59]
[58]
[57]
[56]
[55]
[54]
[53]
[52]
[51]
[50]
[49]
[48]
[47]
[46]
[45]
[44]
[43]
[42]
[41]
[40]
[39]
[38]
[37]
[36]
[35]
[34]
[33]
[32]
[31]
[30]
[29]
[28]
[27]
[26]
[25]
[24]
[23]
[22]
[21]
[20]
[19]
[18]
[17]
[16]
[15]
[14]
[13]
[12]
[11]
[10]
[9]
[8]
[7]
[6]
[5]
[4]
[3]
[2]

{"sheet":"GOF test","index":2,"n_rows":505,"n_cols":20,"rows_kept":505,"cut":false,"hidden":false,"merged":[[22,12,22,14],[1,3,1,12],[4,16,4,19]]}
[]
[null,null,null,"Chi-Square Goodness-of-Fit Test of system´s TTF´s to an Exponential distribution"]
[]
[null,null,null,null,"System´s"]
[null,null,null,null,"TTF´s",null,"UIL","f(i)","f(i)%","F(i)","F(i)%",null,null,null,null,null,"Auxiliary table"]
[null,null,null,1,{"$f":"'Serial system'!P20","v":1757.1347836663849},null,{"$f":"M7+($M$6-$M$7)/10","v":249.49132354235758},{"$f":"J6","v":171},{"$f":"H6/$J$15","v":0.34897959183673471},{"$f":"FREQUENCY($E$16:$E$505,G6)","v":171},{"$f":"J6/$J$15","v":0.34897959183673471},"Max. =",{"$f":"MAX(E16:E505)","v":2476.148889526291},null,null,null,{"$f":"EXPONDIST(G6,1/$M$9,1)*100","v":38.098504923606484},{"$f":"Q6","v":38.098504923606484},{"$f":"R6*COUNT(E16:E505)/100","v":186.68267412567175},{"$f":"(H6-S6)^2/S6","v":1.3174563139504163}]
[null,null,null,2,{"$f":"'Serial system'!P21","v":831.23460517167769},null,{"$f":"G6+($M$6-$M$7)/10","v":496.89771976279462},{"$f":"J7-J6","v":106},0.21632653061224491,{"$f":"FREQUENCY($E$16:$E$505,G7)","v":277},0.5653061224489796,"Mín. =",{"$f":"MIN(E16:E505)","v":2.0849273219205315},null,null,null,61.528158869853279,{"$f":"Q7-Q6","v":23.429653946246795},{"$f":"R7*COUNT(E17:E506)/100","v":114.57100779714683},0.64119340548020609]
[null,null,null,3,{"$f":"'Serial system'!P22","v":820.83412589405589},null,744.30411598323167,82,0.16734693877551021,359,0.73265306122448981,null,null,null,null,null,76.089712241737331,{"$f":"Q8-Q7","v":14.561553371884052},71.060380454794171,1.6841350275345361]
[null,null,null,4,{"$f":"'Serial system'!P23","v":338.78805570835698},null,991.71051220366871,59,0.12040816326530612,418,0.85306122448979593,"MTTF =",{"$f":"'Serial system'!P11","v":520.17905566008392},"(analítico)",null,null,85.139732233013987,9.0500199912766561,44.073597357517322,5.0551239109941379]
[null,null,null,5,{"$f":"'Serial system'!P24","v":231.1639059339484},null,1239.1169084241058,35,7.1428571428571425E-2,453,0.92448979591836733,"MTTF =",{"$f":"AVERAGE(E16:E505)","v":519.38146844816424},"(simulação)",null,null,90.764328713266437,5.6245964802524497,27.335538894026904,2.1489960111161555]
[null,null,null,6,{"$f":"'Serial system'!P25","v":375.97972409360818},null,1486.5233046445428,25,5.1020408163265307E-2,478,0.97551020408163269,null,null,null,null,null,94.260021053853805,3.4956923405873681,16.954107851848736,3.8183301076867386]
[null,null,null,7,{"$f":"'Serial system'!P26","v":144.63162710241704},null,1733.9297008649798,6,1.2244897959183673E-2,484,0.98775510204081629,"Mission =",{"$f":"'Serial system'!P3","v":100},null,null,null,96.432597341405142,2.1725762875513368,10.515269231748471,1.9388620287171083]
[null,null,null,8,{"$f":"'Serial system'!P27","v":904.02642661816253},null,1981.3360970854169,3,6.1224489795918364E-3,487,0.9938775510204082,"F =",{"$f":"1-EXP(-M12/M9)","v":0.17489241599285144},"(by the analytical method)",null,null,97.782855678051888,1.3502583366467462,6.5217477660037844,1.901745938719803]
[null,null,null,9,{"$f":"'Serial system'!P28","v":86.229367529350839},null,2228.7424933058537,2,4.0816326530612249E-3,489,0.99795918367346936,"F =",{"$f":"FREQUENCY(E16:E505,M12)/COUNTIF(E16:E505,\">0\")","v":0.15306122448979592},"(by MC simulation)",null,null,98.622042585379759,0.83918690732787127,4.0448808933203395,1.0337851665229312]
[null,null,null,10,{"$f":"'Serial system'!P29","v":884.97243408880195},null,2476.148889526291,1,2.0408163265306124E-3,490,1,null,null,null,null,null,99.143598087995215,0.52155550261545613,2.508681967580344,0.90729766017230407]
[null,null,null,11,{"$f":"'Serial system'!P30","v":469.09601622807577},null,null,null,null,null,null,null,null,null,null,null,null,null,null,{"$f":"SUM(T6:T15)","v":20.446925570894336}]
[null,null,null,12,{"$f":"'Serial system'!P31","v":526.88175459215063},null,null,null,null,null,null,null,null,null,null,null,null,null,"Degrees of freedom =",9]
[null,null,null,13,{"$f":"'Serial system'!P32","v":645.71649063641598},null,null,null,null,null,null,"Average =",{"$f":"AVERAGE(E16:E505)","v":519.38146844816424}]
[null,null,null,14,{"$f":"'Serial system'!P33","v":43.234889422543802},null,null,null,null,null,null,"St.Dev. =",{"$f":"STDEV(E16:E505)","v":427.94882242973284}]
[null,null,null,15,{"$f":"'Serial system'!P34","v":210.61834457098894},null,null,null,null,null,null,"Level of significance =",0.05]
[null,null,null,16,{"$f":"'Serial system'!P35","v":1147.4930221684542},null,null,null,null,null,null,"Critical value of Q2 =",{"$f":"CHIINV(M20,T17)","v":16.918977604620451}]
[null,null,null,17,{"$f":"'Serial system'!P36","v":382.93971855994209},null,null,null,null,null,null,"Q2 obtained =",{"$f":"T16","v":20.446925570894336}]
[null,null,null,18,{"$f":"'Serial system'!P37","v":68.324041961610874},null,null,null,null,null,null,"Conclusion =",{"$f":"IF(M22>M21,\"The fit is not good enough\",\"The fit is sufficiently good\")","v":"The fit is not good enough"}]
[null,null,null,19,{"$f":"'Serial system'!P38","v":612.74351680285054},null,null,null,null,null,null,"Statistical proof =",{"$f":"IF(M22>M21,\"-\",CHIDIST(M22,T17))","v":"-"}]
[null,null,null,20,{"$f":"'Serial system'!P39","v":90.227411142158871}]
[null,null,null,21,{"$f":"'Serial system'!P40","v":856.88342098277599}]
[null,null,null,22,{"$f":"'Serial system'!P41","v":534.82312649361597}]
[null,null,null,23,{"$f":"'Serial system'!P42","v":7.8081218881709447}]
[null,null,null,24,{"$f":"'Serial system'!P43","v":449.12395412687147}]
[null,null,null,25,{"$f":"'Serial system'!P44","v":646.00758943105848}]
[null,null,null,26,{"$f":"'Serial system'!P45","v":732.03766536093917}]
[null,null,null,27,{"$f":"'Serial system'!P46","v":110.2995534542988}]
[null,null,null,28,{"$f":"'Serial system'!P47","v":314.32365972158004}]
[null,null,null,29,{"$f":"'Serial system'!P48","v":253.7143505283675}]
[null,null,null,30,{"$f":"'Serial system'!P49","v":988.63762205680905}]
[null,null,null,31,{"$f":"'Serial system'!P50","v":492.5799343467479}]
[null,null,null,32,{"$f":"'Serial system'!P51","v":653.7652517758147}]
[null,null,null,33,{"$f":"'Serial system'!P52","v":61.924227081809477}]
[null,null,null,34,{"$f":"'Serial system'!P53","v":970.79816584119931}]
[null,null,null,35,{"$f":"'Serial system'!P54","v":418.02590613569123}]
[null,null,null,36,{"$f":"'Serial system'!P55","v":315.15694927012009}]
[null,null,null,37,{"$f":"'Serial system'!P56","v":255.27416049880094}]
[null,null,null,38,{"$f":"'Serial system'!P57","v":1312.4780965601515}]
[null,null,null,39,{"$f":"'Serial system'!P58","v":620.99426416367305}]
[null,null,null,40,{"$f":"'Serial system'!P59","v":282.64690632321685}]
[null,null,null,41,{"$f":"'Serial system'!P60","v":559.97269913293599}]
[null,null,null,42,{"$f":"'Serial system'!P61","v":206.42341531238367}]
[null,null,null,43,{"$f":"'Serial system'!P62","v":108.10699572978956}]
[null,null,null,44,{"$f":"'Serial system'!P63","v":278.93890199261546}]
[null,null,null,45,{"$f":"'Serial system'!P64","v":321.81628979023526}]
[null,null,null,46,{"$f":"'Serial system'!P65","v":798.92466752073028}]
[null,null,null,47,{"$f":"'Serial system'!P66","v":1388.3827502281795}]
[null,null,null,48,{"$f":"'Serial system'!P67","v":660.32406776897074}]
[null,null,null,49,{"$f":"'Serial system'!P68","v":14.235804856132745}]
[null,null,null,50,{"$f":"'Serial system'!P69","v":311.77684057369424}]
[null,null,null,51,{"$f":"'Serial system'!P70","v":445.05567420103648}]
[null,null,null,52,{"$f":"'Serial system'!P71","v":88.599286032088685}]
[null,null,null,53,{"$f":"'Serial system'!P72","v":1405.6712602099224}]
[null,null,null,54,{"$f":"'Serial system'!P73","v":98.337611441068475}]
[null,null,null,55,{"$f":"'Serial system'!P74","v":258.60011461614999}]
[null,null,null,56,{"$f":"'Serial system'!P75","v":890.47353331971931}]
[null,null,null,57,{"$f":"'Serial system'!P76","v":1216.4539252836896}]
[null,null,null,58,{"$f":"'Serial system'!P77","v":373.71777525046309}]
[null,null,null,59,{"$f":"'Serial system'!P78","v":1064.0657202239261}]
[null,null,null,60,{"$f":"'Serial system'!P79","v":204.35602544357516}]
[null,null,null,61,{"$f":"'Serial system'!P80","v":25.53668868544446}]
[null,null,null,62,{"$f":"'Serial system'!P81","v":38.041908030857485}]
[null,null,null,63,{"$f":"'Serial system'!P82","v":586.60184804885398}]
[null,null,null,64,{"$f":"'Serial system'!P83","v":1706.4493286218819}]
[null,null,null,65,{"$f":"'Serial system'!P84","v":251.4338916947554}]
[null,null,null,66,{"$f":"'Serial system'!P85","v":173.0140718883124}]
[null,null,null,67,{"$f":"'Serial system'!P86","v":1458.1074936005834}]
[null,null,null,68,{"$f":"'Serial system'!P87","v":56.921182790703824}]
[null,null,null,69,{"$f":"'Serial system'!P88","v":429.03153483701794}]
[null,null,null,70,{"$f":"'Serial system'!P89","v":74.439052375097617}]
[null,null,null,71,{"$f":"'Serial system'!P90","v":136.63702336592928}]
[null,null,null,72,{"$f":"'Serial system'!P91","v":1169.5420012512932}]
[null,null,null,73,{"$f":"'Serial system'!P92","v":893.35400904366634}]
[null,null,null,74,{"$f":"'Serial system'!P93","v":79.297458475406529}]
[null,null,null,75,{"$f":"'Serial system'!P94","v":388.96163399692796}]
[null,null,null,76,{"$f":"'Serial system'!P95","v":153.66433569211722}]
[null,null,null,77,{"$f":"'Serial system'!P96","v":264.50329616820204}]
[null,null,null,78,{"$f":"'Serial system'!P97","v":303.89005275775366}]
[null,null,null,79,{"$f":"'Serial system'!P98","v":1138.6871090401378}]
[null,null,null,80,{"$f":"'Serial system'!P99","v":456.69826789216495}]
[null,null,null,81,{"$f":"'Serial system'!P100","v":1334.9231245775588}]
[null,null,null,82,{"$f":"'Serial system'!P101","v":94.464929497212097}]
[null,null,null,83,{"$f":"'Serial system'!P102","v":77.590862087906316}]
[null,null,null,84,{"$f":"'Serial system'!P103","v":299.82577249159658}]
[null,null,null,85,{"$f":"'Serial system'!P104","v":286.30901506029295}]
[null,null,null,86,{"$f":"'Serial system'!P105","v":221.96401421211976}]
[null,null,null,87,{"$f":"'Serial system'!P106","v":1354.6095664983854}]
[null,null,null,88,{"$f":"'Serial system'!P107","v":11.575165538579768}]
[null,null,null,89,{"$f":"'Serial system'!P108","v":1335.452592241812}]
[null,null,null,90,{"$f":"'Serial system'!P109","v":954.86751965533358}]
[null,null,null,91,{"$f":"'Serial system'!P110","v":48.410818090799694}]
[null,null,null,92,{"$f":"'Serial system'!P111","v":161.95763624955362}]
[null,null,null,93,{"$f":"'Serial system'!P112","v":654.94891965534475}]
[null,null,null,94,{"$f":"'Serial system'!P113","v":465.54253840812294}]
[null,null,null,95,{"$f":"'Serial system'!P114","v":313.84975059501289}]
[null,null,null,96,{"$f":"'Serial system'!P115","v":387.33234899376998}]
[null,null,null,97,{"$f":"'Serial system'!P116","v":152.27397691510191}]
[null,null,null,98,{"$f":"'Serial system'!P117","v":843.51311227759197}]
[null,null,null,99,{"$f":"'Serial system'!P118","v":893.77868723198299}]
[null,null,null,100,{"$f":"'Serial system'!P119","v":867.0773197059325}]
[null,null,null,101,{"$f":"'Serial system'!P120","v":112.25252421720097}]
[null,null,null,102,{"$f":"'Serial system'!P121","v":196.45370342829892}]
[null,null,null,103,{"$f":"'Serial system'!P122","v":789.09908279701222}]
[null,null,null,104,{"$f":"'Serial system'!P123","v":373.44748993007624}]
[null,null,null,105,{"$f":"'Serial system'!P124","v":900.80425611911596}]
[null,null,null,106,{"$f":"'Serial system'!P125","v":291.00266187372563}]
[null,null,null,107,{"$f":"'Serial system'!P126","v":543.88759096085141}]
[null,null,null,108,{"$f":"'Serial system'!P127","v":501.30016313105898}]
[null,null,null,109,{"$f":"'Serial system'!P128","v":857.40350347868389}]
[null,null,null,110,{"$f":"'Serial system'!P129","v":211.38385111230536}]
[null,null,null,111,{"$f":"'Serial system'!P130","v":336.7730596937181}]
[null,null,null,112,{"$f":"'Serial system'!P131","v":775.44816406175232}]
[null,null,null,113,{"$f":"'Serial system'!P132","v":71.513553284298723}]
[null,null,null,114,{"$f":"'Serial system'!P133","v":219.36214168782362}]
[null,null,null,115,{"$f":"'Serial system'!P134","v":816.28529197160788}]
[null,null,null,116,{"$f":"'Serial system'!P135","v":1016.5655943672386}]
[null,null,null,117,{"$f":"'Serial system'!P136","v":300.62185283044573}]
[null,null,null,118,{"$f":"'Serial system'!P137","v":7.3333235968002555}]
[null,null,null,119,{"$f":"'Serial system'!P138","v":138.72240370384202}]
[null,null,null,120,{"$f":"'Serial system'!P139","v":695.94173099800264}]
[null,null,null,121,{"$f":"'Serial system'!P140","v":141.35842545452101}]
[null,null,null,122,{"$f":"'Serial system'!P141","v":475.76175426331042}]
[null,null,null,123,{"$f":"'Serial system'!P142","v":574.0976109530709}]
[null,null,null,124,{"$f":"'Serial system'!P143","v":344.88266433996409}]
[null,null,null,125,{"$f":"'Serial system'!P144","v":768.39701126352497}]
[null,null,null,126,{"$f":"'Serial system'!P145","v":366.40156166494467}]
[null,null,null,127,{"$f":"'Serial system'!P146","v":106.46401247009362}]
[null,null,null,128,{"$f":"'Serial system'!P147","v":1295.8298848985862}]
[null,null,null,129,{"$f":"'Serial system'!P148","v":335.37893018484738}]
[null,null,null,130,{"$f":"'Serial system'!P149","v":982.98421988517998}]
[null,null,null,131,{"$f":"'Serial system'!P150","v":143.05378747842224}]
[null,null,null,132,{"$f":"'Serial system'!P151","v":90.461523397503697}]
[null,null,null,133,{"$f":"'Serial system'!P152","v":898.30676732534016}]
[null,null,null,134,{"$f":"'Serial system'!P153","v":204.43822517782337}]
[null,null,null,135,{"$f":"'Serial system'!P154","v":84.09398385150962}]
[null,null,null,136,{"$f":"'Serial system'!P155","v":1453.7468227222246}]
[null,null,null,137,{"$f":"'Serial system'!P156","v":164.61755196075637}]
[null,null,null,138,{"$f":"'Serial system'!P157","v":188.27107257207103}]
[null,null,null,139,{"$f":"'Serial system'!P158","v":1234.575133993736}]
[null,null,null,140,{"$f":"'Serial system'!P159","v":429.06795497520579}]
[null,null,null,141,{"$f":"'Serial system'!P160","v":137.6971593639289}]
[null,null,null,142,{"$f":"'Serial system'!P161","v":100.18231491407141}]
[null,null,null,143,{"$f":"'Serial system'!P162","v":583.33284401187325}]
[null,null,null,144,{"$f":"'Serial system'!P163","v":1274.4233602865575}]
[null,null,null,145,{"$f":"'Serial system'!P164","v":380.75164304105601}]
[null,null,null,146,{"$f":"'Serial system'!P165","v":140.58832198290452}]
[null,null,null,147,{"$f":"'Serial system'!P166","v":131.40118346584086}]
[null,null,null,148,{"$f":"'Serial system'!P167","v":1240.9947468917292}]
[null,null,null,149,{"$f":"'Serial system'!P168","v":619.15980958104615}]
[null,null,null,150,{"$f":"'Serial system'!P169","v":9.8110084102543169}]
[null,null,null,151,{"$f":"'Serial system'!P170","v":994.4251951149738}]
[null,null,null,152,{"$f":"'Serial system'!P171","v":769.70213677984952}]
[null,null,null,153,{"$f":"'Serial system'!P172","v":255.07069823776783}]
[null,null,null,154,{"$f":"'Serial system'!P173","v":549.18656306791581}]
[null,null,null,155,{"$f":"'Serial system'!P174","v":171.51838554184724}]
[null,null,null,156,{"$f":"'Serial system'!P175","v":645.03421589729874}]
[null,null,null,157,{"$f":"'Serial system'!P176","v":614.62912096865534}]
[null,null,null,158,{"$f":"'Serial system'!P177","v":206.41771348846032}]
[null,null,null,159,{"$f":"'Serial system'!P178","v":901.7810852300845}]
[null,null,null,160,{"$f":"'Serial system'!P179","v":122.63340738837996}]
[null,null,null,161,{"$f":"'Serial system'!P180","v":600.49816089084311}]
[null,null,null,162,{"$f":"'Serial system'!P181","v":770.65964326698281}]
[null,null,null,163,{"$f":"'Serial system'!P182","v":402.14265256139333}]
[null,null,null,164,{"$f":"'Serial system'!P183","v":385.02490957936516}]
[null,null,null,165,{"$f":"'Serial system'!P184","v":727.27984259355912}]
[null,null,null,166,{"$f":"'Serial system'!P185","v":288.59033946561158}]
[null,null,null,167,{"$f":"'Serial system'!P186","v":377.3625253897751}]
[null,null,null,168,{"$f":"'Serial system'!P187","v":1342.1621885911281}]
[null,null,null,169,{"$f":"'Serial system'!P188","v":557.47536208646261}]
[null,null,null,170,{"$f":"'Serial system'!P189","v":18.444423434566261}]
[null,null,null,171,{"$f":"'Serial system'!P190","v":390.43673485685281}]
[null,null,null,172,{"$f":"'Serial system'!P191","v":35.928904108060124}]
[null,null,null,173,{"$f":"'Serial system'!P192","v":4.5982751516403368}]
[null,null,null,174,{"$f":"'Serial system'!P193","v":1637.3771216374018}]
[null,null,null,175,{"$f":"'Serial system'!P194","v":29.172957257467033}]
[null,null,null,176,{"$f":"'Serial system'!P195","v":911.84965770381996}]
[null,null,null,177,{"$f":"'Serial system'!P196","v":363.37449266255862}]
[null,null,null,178,{"$f":"'Serial system'!P197","v":400.80093984496762}]
[null,null,null,179,{"$f":"'Serial system'!P198","v":1085.6174631776807}]
[null,null,null,180,{"$f":"'Serial system'!P199","v":482.31497306485699}]
[null,null,null,181,{"$f":"'Serial system'!P200","v":147.19859666195953}]
[null,null,null,182,{"$f":"'Serial system'!P201","v":294.97245799650136}]
[null,null,null,183,{"$f":"'Serial system'!P202","v":568.93008661274644}]
[null,null,null,184,{"$f":"'Serial system'!P203","v":1285.8255617249458}]
[null,null,null,185,{"$f":"'Serial system'!P204","v":133.11229798818727}]
[null,null,null,186,{"$f":"'Serial system'!P205","v":245.6457820357432}]
[null,null,null,187,{"$f":"'Serial system'!P206","v":137.83009276159783}]
[null,null,null,188,{"$f":"'Serial system'!P207","v":1198.8840085230081}]
[null,null,null,189,{"$f":"'Serial system'!P208","v":22.475374742938584}]
[null,null,null,190,{"$f":"'Serial system'!P209","v":557.01581427902556}]
[null,null,null,191,{"$f":"'Serial system'!P210","v":679.84664820947523}]
[null,null,null,192,{"$f":"'Serial system'!P211","v":189.92423112099254}]
[null,null,null,193,{"$f":"'Serial system'!P212","v":611.45804636188086}]
[null,null,null,194,{"$f":"'Serial system'!P213","v":294.58285548819686}]
[null,null,null,195,{"$f":"'Serial system'!P214","v":733.21349871251437}]
[null,null,null,196,{"$f":"'Serial system'!P215","v":721.01671379587265}]
[null,null,null,197,{"$f":"'Serial system'!P216","v":67.99776213250766}]
[null,null,null,198,{"$f":"'Serial system'!P217","v":1593.232049125103}]
[null,null,null,199,{"$f":"'Serial system'!P218","v":91.387424344226929}]
[null,null,null,200,{"$f":"'Serial system'!P219","v":75.135479870678864}]
[null,null,null,201,{"$f":"'Serial system'!P220","v":218.99762414746647}]
[null,null,null,202,{"$f":"'Serial system'!P221","v":822.82237679018363}]
[null,null,null,203,{"$f":"'Serial system'!P222","v":965.57581545340736}]
[null,null,null,204,{"$f":"'Serial system'!P223","v":115.26033332788847}]
[null,null,null,205,{"$f":"'Serial system'!P224","v":1418.1921978042828}]
[null,null,null,206,{"$f":"'Serial system'!P225","v":177.80855491174225}]
[null,null,null,207,{"$f":"'Serial system'!P226","v":75.919031039765287}]
[null,null,null,208,{"$f":"'Serial system'!P227","v":892.50947074539863}]
[null,null,null,209,{"$f":"'Serial system'!P228","v":779.49533724774938}]
[null,null,null,210,{"$f":"'Serial system'!P229","v":692.13514340724714}]
[null,null,null,211,{"$f":"'Serial system'!P230","v":235.50781550101101}]
[null,null,null,212,{"$f":"'Serial system'!P231","v":164.83519855916074}]
[null,null,null,213,{"$f":"'Serial system'!P232","v":247.98555274245746}]
[null,null,null,214,{"$f":"'Serial system'!P233","v":1323.6191414381935}]
[null,null,null,215,{"$f":"'Serial system'!P234","v":847.407566588078}]
[null,null,null,216,{"$f":"'Serial system'!P235","v":903.20581257446884}]
[null,null,null,217,{"$f":"'Serial system'!P236","v":220.08699545322042}]
[null,null,null,218,{"$f":"'Serial system'!P237","v":574.19941060577526}]
[null,null,null,219,{"$f":"'Serial system'!P238","v":394.45653113284857}]
[null,null,null,220,{"$f":"'Serial system'!P239","v":670.52541763052386}]
[null,null,null,221,{"$f":"'Serial system'!P240","v":71.170118341166472}]
[null,null,null,222,{"$f":"'Serial system'!P241","v":160.78903547016807}]
[null,null,null,223,{"$f":"'Serial system'!P242","v":179.14509019365005}]
[null,null,null,224,{"$f":"'Serial system'!P243","v":1120.3736515376092}]
[null,null,null,225,{"$f":"'Serial system'!P244","v":709.80753109280977}]
[null,null,null,226,{"$f":"'Serial system'!P245","v":220.47827051838726}]
[null,null,null,227,{"$f":"'Serial system'!P246","v":144.50275177005233}]
[null,null,null,228,{"$f":"'Serial system'!P247","v":944.48180530972786}]
[null,null,null,229,{"$f":"'Serial system'!P248","v":421.11032181970063}]
[null,null,null,230,{"$f":"'Serial system'!P249","v":18.208801673480593}]
[null,null,null,231,{"$f":"'Serial system'!P250","v":122.10167427441684}]
[null,null,null,232,{"$f":"'Serial system'!P251","v":1208.3266870573846}]
[null,null,null,233,{"$f":"'Serial system'!P252","v":554.16045699359279}]
[null,null,null,234,{"$f":"'Serial system'!P253","v":657.07522417602468}]
[null,null,null,235,{"$f":"'Serial system'!P254","v":538.27541362537136}]
[null,null,null,236,{"$f":"'Serial system'!P255","v":1223.6424793970266}]
[null,null,null,237,{"$f":"'Serial system'!P256","v":60.017244317513359}]
[null,null,null,238,{"$f":"'Serial system'!P257","v":121.14963910118604}]
[null,null,null,239,{"$f":"'Serial system'!P258","v":473.08274868077024}]
[null,null,null,240,{"$f":"'Serial system'!P259","v":1129.9662370809021}]
[null,null,null,241,{"$f":"'Serial system'!P260","v":527.74250907827241}]
[null,null,null,242,{"$f":"'Serial system'!P261","v":966.79206552011601}]
[null,null,null,243,{"$f":"'Serial system'!P262","v":294.07282481332231}]
[null,null,null,244,{"$f":"'Serial system'!P263","v":46.89986039248538}]
[null,null,null,245,{"$f":"'Serial system'!P264","v":31.215601591356744}]
[null,null,null,246,{"$f":"'Serial system'!P265","v":478.41487238843456}]
[null,null,null,247,{"$f":"'Serial system'!P266","v":549.2250528245313}]
[null,null,null,248,{"$f":"'Serial system'!P267","v":807.23164501353358}]
[null,null,null,249,{"$f":"'Serial system'!P268","v":216.03397171441065}]
[null,null,null,250,{"$f":"'Serial system'!P269","v":1338.0532076715476}]
[null,null,null,251,{"$f":"'Serial system'!P270","v":61.217712519279758}]
[null,null,null,252,{"$f":"'Serial system'!P271","v":165.20355006895488}]
[null,null,null,253,{"$f":"'Serial system'!P272","v":820.45483078432926}]
[null,null,null,254,{"$f":"'Serial system'!P273","v":652.53994960575415}]
[null,null,null,255,{"$f":"'Serial system'!P274","v":744.83915559902266}]
[null,null,null,256,{"$f":"'Serial system'!P275","v":82.573595043043497}]
[null,null,null,257,{"$f":"'Serial system'!P276","v":529.87799746904193}]
[null,null,null,258,{"$f":"'Serial system'!P277","v":314.84939819767169}]
[null,null,null,259,{"$f":"'Serial system'!P278","v":24.868077327995252}]
[null,null,null,260,{"$f":"'Serial system'!P279","v":1120.4750756126386}]
[null,null,null,261,{"$f":"'Serial system'!P280","v":366.87243786591739}]
[null,null,null,262,{"$f":"'Serial system'!P281","v":881.11359296247269}]
[null,null,null,263,{"$f":"'Serial system'!P282","v":247.69091693005203}]
[null,null,null,264,{"$f":"'Serial system'!P283","v":221.85783902106959}]
[null,null,null,265,{"$f":"'Serial system'!P284","v":890.88471934740051}]
[null,null,null,266,{"$f":"'Serial system'!P285","v":398.76424407882223}]
[null,null,null,267,{"$f":"'Serial system'!P286","v":1186.6142808959833}]
[null,null,null,268,{"$f":"'Serial system'!P287","v":60.024627887842144}]
[null,null,null,269,{"$f":"'Serial system'!P288","v":167.98527990419279}]
[null,null,null,270,{"$f":"'Serial system'!P289","v":234.03318733092078}]
[null,null,null,271,{"$f":"'Serial system'!P290","v":471.7562126011785}]
[null,null,null,272,{"$f":"'Serial system'!P291","v":305.60592964075317}]
[null,null,null,273,{"$f":"'Serial system'!P292","v":432.24683054135335}]
[null,null,null,274,{"$f":"'Serial system'!P293","v":1238.5635714934351}]
[null,null,null,275,{"$f":"'Serial system'!P294","v":238.05292052767368}]
[null,null,null,276,{"$f":"'Serial system'!P295","v":322.14481479136361}]
[null,null,null,277,{"$f":"'Serial system'!P296","v":1314.4247593673222}]
[null,null,null,278,{"$f":"'Serial system'!P297","v":745.68148147463535}]
[null,null,null,279,{"$f":"'Serial system'!P298","v":139.10794014602925}]
[null,null,null,280,{"$f":"'Serial system'!P299","v":198.20230980739962}]
[null,null,null,281,{"$f":"'Serial system'!P300","v":870.33517697851039}]
[null,null,null,282,{"$f":"'Serial system'!P301","v":410.13579220265001}]
[null,null,null,283,{"$f":"'Serial system'!P302","v":408.95629900145673}]
[null,null,null,284,{"$f":"'Serial system'!P303","v":220.41521233178469}]
[null,null,null,285,{"$f":"'Serial system'!P304","v":32.337398587794723}]
[null,null,null,286,{"$f":"'Serial system'!P305","v":1310.0894507068847}]
[null,null,null,287,{"$f":"'Serial system'!P306","v":247.44151086642614}]
[null,null,null,288,{"$f":"'Serial system'!P307","v":261.01183669105626}]
[null,null,null,289,{"$f":"'Serial system'!P308","v":591.97943305928425}]
[null,null,null,290,{"$f":"'Serial system'!P309","v":661.8982284923859}]
[null,null,null,291,{"$f":"'Serial system'!P310","v":183.30284076877888}]
[null,null,null,292,{"$f":"'Serial system'!P311","v":187.12434601787459}]
[null,null,null,293,{"$f":"'Serial system'!P312","v":719.35114933138107}]
[null,null,null,294,{"$f":"'Serial system'!P313","v":867.07713294454788}]
[null,null,null,295,{"$f":"'Serial system'!P314","v":1058.7146279142944}]
[null,null,null,296,{"$f":"'Serial system'!P315","v":76.541877022579456}]
[null,null,null,297,{"$f":"'Serial system'!P316","v":1526.4274898833921}]
[null,null,null,298,{"$f":"'Serial system'!P317","v":884.53980269923682}]
[null,null,null,299,{"$f":"'Serial system'!P318","v":333.75735145331055}]
[null,null,null,300,{"$f":"'Serial system'!P319","v":178.81964280229749}]
[null,null,null,301,{"$f":"'Serial system'!P320","v":111.99784618030299}]
[null,null,null,302,{"$f":"'Serial system'!P321","v":192.78681594563659}]
[null,null,null,303,{"$f":"'Serial system'!P322","v":1117.7145841664296}]
[null,null,null,304,{"$f":"'Serial system'!P323","v":515.10868708325233}]
[null,null,null,305,{"$f":"'Serial system'!P324","v":217.44434475136859}]
[null,null,null,306,{"$f":"'Serial system'!P325","v":304.65225724780203}]
[null,null,null,307,{"$f":"'Serial system'!P326","v":1012.1084338053879}]
[null,null,null,308,{"$f":"'Serial system'!P327","v":278.56839007696158}]
[null,null,null,309,{"$f":"'Serial system'!P328","v":1046.035537508649}]
[null,null,null,310,{"$f":"'Serial system'!P329","v":437.12385893004557}]
[null,null,null,311,{"$f":"'Serial system'!P330","v":119.77781080868613}]
[null,null,null,312,{"$f":"'Serial system'!P331","v":242.23041391179368}]
[null,null,null,313,{"$f":"'Serial system'!P332","v":379.9787341794995}]
[null,null,null,314,{"$f":"'Serial system'!P333","v":530.58731295971165}]
[null,null,null,315,{"$f":"'Serial system'!P334","v":1480.8185924120094}]
[null,null,null,316,{"$f":"'Serial system'!P335","v":326.13180480441588}]
[null,null,null,317,{"$f":"'Serial system'!P336","v":149.34060198766883}]
[null,null,null,318,{"$f":"'Serial system'!P337","v":1056.6126654623963}]
[null,null,null,319,{"$f":"'Serial system'!P338","v":368.26107808568031}]
[null,null,null,320,{"$f":"'Serial system'!P339","v":190.16504140174948}]
[null,null,null,321,{"$f":"'Serial system'!P340","v":580.23850278056307}]
[null,null,null,322,{"$f":"'Serial system'!P341","v":247.13199267474965}]
[null,null,null,323,{"$f":"'Serial system'!P342","v":711.06700412458167}]
[null,null,null,324,{"$f":"'Serial system'!P343","v":1198.1045717608386}]
[null,null,null,325,{"$f":"'Serial system'!P344","v":718.0484656102567}]
[null,null,null,326,{"$f":"'Serial system'!P345","v":614.28083415529568}]
[null,null,null,327,{"$f":"'Serial system'!P346","v":82.034020081859353}]
[null,null,null,328,{"$f":"'Serial system'!P347","v":250.07680621193776}]
[null,null,null,329,{"$f":"'Serial system'!P348","v":1349.8213806281083}]
[null,null,null,330,{"$f":"'Serial system'!P349","v":82.920293996785404}]
[null,null,null,331,{"$f":"'Serial system'!P350","v":684.2437357394374}]
[null,null,null,332,{"$f":"'Serial system'!P351","v":444.32299490074001}]
[null,null,null,333,{"$f":"'Serial system'!P352","v":474.64551822704789}]
[null,null,null,334,{"$f":"'Serial system'!P353","v":1032.3558418535522}]
[null,null,null,335,{"$f":"'Serial system'!P354","v":341.14631602385043}]
[null,null,null,336,{"$f":"'Serial system'!P355","v":130.48340020223759}]
[null,null,null,337,{"$f":"'Serial system'!P356","v":714.72767409794642}]
[null,null,null,338,{"$f":"'Serial system'!P357","v":204.18034168086297}]
[null,null,null,339,{"$f":"'Serial system'!P358","v":1041.3013073043544}]
[null,null,null,340,{"$f":"'Serial system'!P359","v":398.65143358403748}]
[null,null,null,341,{"$f":"'Serial system'!P360","v":539.50168365627292}]
[null,null,null,342,{"$f":"'Serial system'!P361","v":142.49870528732959}]
[null,null,null,343,{"$f":"'Serial system'!P362","v":540.10742083785954}]
[null,null,null,344,{"$f":"'Serial system'!P363","v":670.88446124316079}]
[null,null,null,345,{"$f":"'Serial system'!P364","v":852.31715709290211}]
[null,null,null,346,{"$f":"'Serial system'!P365","v":328.75624561668519}]
[null,null,null,347,{"$f":"'Serial system'!P366","v":1337.0933302685457}]
[null,null,null,348,{"$f":"'Serial system'!P367","v":2.0849273219205315}]
[null,null,null,349,{"$f":"'Serial system'!P368","v":51.193655492221296}]
[null,null,null,350,{"$f":"'Serial system'!P369","v":520.78509324576862}]
[null,null,null,351,{"$f":"'Serial system'!P370","v":199.51173508243301}]
[null,null,null,352,{"$f":"'Serial system'!P371","v":213.67930562490619}]
[null,null,null,353,{"$f":"'Serial system'!P372","v":1152.070504324111}]
[null,null,null,354,{"$f":"'Serial system'!P373","v":831.43611219334662}]
[null,null,null,355,{"$f":"'Serial system'!P374","v":137.05890587224121}]
[null,null,null,356,{"$f":"'Serial system'!P375","v":1244.4770859195469}]
[null,null,null,357,{"$f":"'Serial system'!P376","v":312.94192783219387}]
[null,null,null,358,{"$f":"'Serial system'!P377","v":452.00978004893705}]
[null,null,null,359,{"$f":"'Serial system'!P378","v":391.08635413210141}]
[null,null,null,360,{"$f":"'Serial system'!P379","v":16.809982661839058}]
[null,null,null,361,{"$f":"'Serial system'!P380","v":766.67494687236081}]
[null,null,null,362,{"$f":"'Serial system'!P381","v":1270.3570284071463}]
[null,null,null,363,{"$f":"'Serial system'!P382","v":439.051904988562}]
[null,null,null,364,{"$f":"'Serial system'!P383","v":448.30297137364346}]
[null,null,null,365,{"$f":"'Serial system'!P384","v":801.40588609273573}]
[null,null,null,366,{"$f":"'Serial system'!P385","v":208.83165797935453}]
[null,null,null,367,{"$f":"'Serial system'!P386","v":573.56180042426445}]
[null,null,null,368,{"$f":"'Serial system'!P387","v":201.99247544830223}]
[null,null,null,369,{"$f":"'Serial system'!P388","v":69.565962540796136}]
[null,null,null,370,{"$f":"'Serial system'!P389","v":1638.8512803458466}]
[null,null,null,371,{"$f":"'Serial system'!P390","v":143.04168844669312}]
[null,null,null,372,{"$f":"'Serial system'!P391","v":60.952347291203296}]
[null,null,null,373,{"$f":"'Serial system'!P392","v":466.59071642954268}]
[null,null,null,374,{"$f":"'Serial system'!P393","v":54.492093937492882}]
[null,null,null,375,{"$f":"'Serial system'!P394","v":589.02650199354412}]
[null,null,null,376,{"$f":"'Serial system'!P395","v":840.77675406015896}]
[null,null,null,377,{"$f":"'Serial system'!P396","v":644.49129208970999}]
[null,null,null,378,{"$f":"'Serial system'!P397","v":61.056803323617714}]
[null,null,null,379,{"$f":"'Serial system'!P398","v":391.98773795979969}]
[null,null,null,380,{"$f":"'Serial system'!P399","v":75.220166177844476}]
[null,null,null,381,{"$f":"'Serial system'!P400","v":345.27788854071105}]
[null,null,null,382,{"$f":"'Serial system'!P401","v":2130.3265690841304}]
[null,null,null,383,{"$f":"'Serial system'!P402","v":505.13608048516653}]
[null,null,null,384,{"$f":"'Serial system'!P403","v":458.79105319250539}]
[null,null,null,385,{"$f":"'Serial system'!P404","v":49.049349120828992}]
[null,null,null,386,{"$f":"'Serial system'!P405","v":576.57476079009712}]
[null,null,null,387,{"$f":"'Serial system'!P406","v":396.14139078672815}]
[null,null,null,388,{"$f":"'Serial system'!P407","v":371.97977975622598}]
[null,null,null,389,{"$f":"'Serial system'!P408","v":697.91439195002704}]
[null,null,null,390,{"$f":"'Serial system'!P409","v":824.1433192032755}]
[null,null,null,391,{"$f":"'Serial system'!P410","v":759.5754555469066}]
[null,null,null,392,{"$f":"'Serial system'!P411","v":100.91422428323585}]
[null,null,null,393,{"$f":"'Serial system'!P412","v":1884.6163501249926}]
[null,null,null,394,{"$f":"'Serial system'!P413","v":520.01774071170848}]
[null,null,null,395,{"$f":"'Serial system'!P414","v":199.79961171577361}]
[null,null,null,396,{"$f":"'Serial system'!P415","v":654.06022058659801}]
[null,null,null,397,{"$f":"'Serial system'!P416","v":157.76131304077376}]
[null,null,null,398,{"$f":"'Serial system'!P417","v":218.79807948114262}]
[null,null,null,399,{"$f":"'Serial system'!P418","v":208.7619215560112}]
[null,null,null,400,{"$f":"'Serial system'!P419","v":398.26241403820086}]
[null,null,null,401,{"$f":"'Serial system'!P420","v":649.81369116550604}]
[null,null,null,402,{"$f":"'Serial system'!P421","v":218.1928815084309}]
[null,null,null,403,{"$f":"'Serial system'!P422","v":466.70419004573591}]
[null,null,null,404,{"$f":"'Serial system'!P423","v":457.57341174900034}]
[null,null,null,405,{"$f":"'Serial system'!P424","v":1840.4617880876583}]
[null,null,null,406,{"$f":"'Serial system'!P425","v":83.360794652059212}]
[null,null,null,407,{"$f":"'Serial system'!P426","v":867.94736701685338}]
[null,null,null,408,{"$f":"'Serial system'!P427","v":119.23357870514155}]
[null,null,null,409,{"$f":"'Serial system'!P428","v":81.193301012564916}]
[null,null,null,410,{"$f":"'Serial system'!P429","v":722.62600858915175}]
[null,null,null,411,{"$f":"'Serial system'!P430","v":55.503138013539683}]
[null,null,null,412,{"$f":"'Serial system'!P431","v":517.33127643591456}]
[null,null,null,413,{"$f":"'Serial system'!P432","v":2476.148889526291}]
[null,null,null,414,{"$f":"'Serial system'!P433","v":67.789735947592817}]
[null,null,null,415,{"$f":"'Serial system'!P434","v":76.027396405863328}]
[null,null,null,416,{"$f":"'Serial system'!P435","v":83.751353447463771}]
[null,null,null,417,{"$f":"'Serial system'!P436","v":1013.9346817018368}]
[null,null,null,418,{"$f":"'Serial system'!P437","v":603.0110585013208}]
[null,null,null,419,{"$f":"'Serial system'!P438","v":273.74501302578756}]
[null,null,null,420,{"$f":"'Serial system'!P439","v":465.76000356739405}]
[null,null,null,421,{"$f":"'Serial system'!P440","v":832.27715538768598}]
[null,null,null,422,{"$f":"'Serial system'!P441","v":211.48314979023189}]
[null,null,null,423,{"$f":"'Serial system'!P442","v":560.70878057763639}]
[null,null,null,424,{"$f":"'Serial system'!P443","v":176.15800712931696}]
[null,null,null,425,{"$f":"'Serial system'!P444","v":580.22229964733469}]
[null,null,null,426,{"$f":"'Serial system'!P445","v":685.25828453413374}]
[null,null,null,427,{"$f":"'Serial system'!P446","v":197.04476211883843}]
[null,null,null,428,{"$f":"'Serial system'!P447","v":92.316442423947137}]
[null,null,null,429,{"$f":"'Serial system'!P448","v":746.31528401868491}]
[null,null,null,430,{"$f":"'Serial system'!P449","v":520.05813767838572}]
[null,null,null,431,{"$f":"'Serial system'!P450","v":290.06208470540491}]
[null,null,null,432,{"$f":"'Serial system'!P451","v":878.91948914425416}]
[null,null,null,433,{"$f":"'Serial system'!P452","v":1038.8022358687838}]
[null,null,null,434,{"$f":"'Serial system'!P453","v":351.15675915127576}]
[null,null,null,435,{"$f":"'Serial system'!P454","v":406.38958609847123}]
[null,null,null,436,{"$f":"'Serial system'!P455","v":66.517689984096251}]
[null,null,null,437,{"$f":"'Serial system'!P456","v":4.1931366103299297}]
[null,null,null,438,{"$f":"'Serial system'!P457","v":712.77807895473529}]
[null,null,null,439,{"$f":"'Serial system'!P458","v":810.12119975801647}]
[null,null,null,440,{"$f":"'Serial system'!P459","v":880.58388797926455}]
[null,null,null,441,{"$f":"'Serial system'!P460","v":1013.7512627797194}]
[null,null,null,442,{"$f":"'Serial system'!P461","v":766.79738376643513}]
[null,null,null,443,{"$f":"'Serial system'!P462","v":685.26341277642859}]
[null,null,null,444,{"$f":"'Serial system'!P463","v":64.358147654927961}]
[null,null,null,445,{"$f":"'Serial system'!P464","v":148.15778190444325}]
[null,null,null,446,{"$f":"'Serial system'!P465","v":1081.0938617661402}]
[null,null,null,447,{"$f":"'Serial system'!P466","v":348.46965272922648}]
[null,null,null,448,{"$f":"'Serial system'!P467","v":488.61575895400529}]
[null,null,null,449,{"$f":"'Serial system'!P468","v":2179.865822246843}]
[null,null,null,450,{"$f":"'Serial system'!P469","v":262.37265053904957}]
[null,null,null,451,{"$f":"'Serial system'!P470","v":617.19067954283628}]
[null,null,null,452,{"$f":"'Serial system'!P471","v":361.13985717141759}]
[null,null,null,453,{"$f":"'Serial system'!P472","v":27.870561889097644}]
[null,null,null,454,{"$f":"'Serial system'!P473","v":568.39890042283923}]
[null,null,null,455,{"$f":"'Serial system'!P474","v":89.240247052962332}]
[null,null,null,456,{"$f":"'Serial system'!P475","v":171.47256523155966}]
[null,null,null,457,{"$f":"'Serial system'!P476","v":1745.6720329125394}]
[null,null,null,458,{"$f":"'Serial system'!P477","v":137.09439021900903}]
[null,null,null,459,{"$f":"'Serial system'!P478","v":1055.4070323060541}]
[null,null,null,460,{"$f":"'Serial system'!P479","v":284.56533473181116}]
[null,null,null,461,{"$f":"'Serial system'!P480","v":574.28499342750843}]
[null,null,null,462,{"$f":"'Serial system'!P481","v":155.57861626038607}]
[null,null,null,463,{"$f":"'Serial system'!P482","v":1628.315697184406}]
[null,null,null,464,{"$f":"'Serial system'!P483","v":400.60544561509596}]
[null,null,null,465,{"$f":"'Serial system'!P484","v":80.300638037528643}]
[null,null,null,466,{"$f":"'Serial system'!P485","v":136.13846059476418}]
[null,null,null,467,{"$f":"'Serial system'!P486","v":747.65351095153528}]
[null,null,null,468,{"$f":"'Serial system'!P487","v":1308.0347049870425}]
[null,null,null,469,{"$f":"'Serial system'!P488","v":39.645072862297638}]
[null,null,null,470,{"$f":"'Serial system'!P489","v":757.20541648995322}]
[null,null,null,471,{"$f":"'Serial system'!P490","v":27.649671132209278}]
[null,null,null,472,{"$f":"'Serial system'!P491","v":62.990843060015322}]
[null,null,null,473,{"$f":"'Serial system'!P492","v":1230.6789436564077}]
[null,null,null,474,{"$f":"'Serial system'!P493","v":83.186097339898879}]
[null,null,null,475,{"$f":"'Serial system'!P494","v":5.0620583516501938}]
[null,null,null,476,{"$f":"'Serial system'!P495","v":807.05262204575138}]
[null,null,null,477,{"$f":"'Serial system'!P496","v":724.69095236722433}]
[null,null,null,478,{"$f":"'Serial system'!P497","v":520.13573936578086}]
[null,null,null,479,{"$f":"'Serial system'!P498","v":873.26115423531155}]
[null,null,null,480,{"$f":"'Serial system'!P499","v":221.64726476451278}]
[null,null,null,481,{"$f":"'Serial system'!P500","v":23.721623088097658}]
[null,null,null,482,{"$f":"'Serial system'!P501","v":57.59298664369544}]
[null,null,null,483,{"$f":"'Serial system'!P502","v":1228.4522993415239}]
[null,null,null,484,{"$f":"'Serial system'!P503","v":302.49034285563584}]
[null,null,null,485,{"$f":"'Serial system'!P504","v":1082.2102702076077}]
[null,null,null,486,{"$f":"'Serial system'!P505","v":92.184368379531861}]
[null,null,null,487,{"$f":"'Serial system'!P506","v":298.89923607151968}]
[null,null,null,488,{"$f":"'Serial system'!P507","v":922.72777910545437}]
[null,null,null,489,{"$f":"'Serial system'!P508","v":1250.6370515845415}]
[null,null,null,490,{"$f":"'Serial system'!P509","v":518.19162919990845}]
[null,null,null,491,{"$f":"'Serial system'!P510","v":511.88691695708144}]
[null,null,null,492,{"$f":"'Serial system'!P511","v":71.001490362243203}]
[null,null,null,493,{"$f":"'Serial system'!P512","v":1052.4489760023901}]
[null,null,null,494,{"$f":"'Serial system'!P513","v":517.48552506418309}]
[null,null,null,495,{"$f":"'Serial system'!P514","v":264.98691042001337}]
[null,null,null,496,{"$f":"'Serial system'!P515","v":163.03314284923204}]
[null,null,null,497,{"$f":"'Serial system'!P516","v":434.26761182291239}]
[null,null,null,498,{"$f":"'Serial system'!P517","v":405.90756696616313}]
[null,null,null,499,{"$f":"'Serial system'!P518","v":872.78959786536643}]
[null,null,null,500,{"$f":"'Serial system'!P519","v":101.85199955183111}]